IOT SDK

cino111
Posty: 712
Rejestracja: pn maja 07, 2018 8:00 pm

pn maja 27, 2019 5:27 pm

Z pomocą @lesmy8 udało mi się zrobić tyle:

Kod: Zaznacz cały

udo apt -y install git curl
sudo apt -y install python-pip && pip 
sudo apt install docker.io
sudo usermod -a -G docker marcin
sudo pip install docker-compose
udało się bo dostałem

Kod: Zaznacz cały

docker -v && docker-compose -v

Docker version 18.09.5, build e8ff056
docker-compose version 1.24.0, build 0aa5906
następnie

Kod: Zaznacz cały

git clone https://github.com/SUPLA/supla-docker.git
cd supla-docker
git checkout espressif
./build.sh
./run.sh
i chyba wszystko ok bo mam:

Kod: Zaznacz cały

marcin@marcin-HP:~$ docker ps
CONTAINER ID        IMAGE               COMMAND             CREATED             STATUS              PORTS               NAMES
b706b9e4da75        devel/esp8266       "/bin/bash"         3 hours ago         Up 3 hours                              xenodochial_hopper
i odpalając kontener przechodzi od razu do CProjects/supla-espressif-esp/src

Kod: Zaznacz cały

marcin@marcin-HP:~/supla-docker$ ./run.sh restart
root@eccffbb80de0:/CProjects/supla-espressif-esp/src#
ale jak chcę coś skompilować to dalej jest coś nie tak

Kod: Zaznacz cały

I ../include -I ../include -I ../include/eagle -I ../driver_lib/include supla_w1.c
/hdd2/Espressif/xtensa-lx106-elf/bin/xtensa-lx106-elf-gcc: 1: /hdd2/Espressif/xtensa-lx106-elf/bin/xtensa-lx106-elf-gcc: ELF: not found
/hdd2/Espressif/xtensa-lx106-elf/bin/xtensa-lx106-elf-gcc: 2: /hdd2/Espressif/xtensa-lx106-elf/bin/xtensa-lx106-elf-gcc: @@@@@@@��@@@@t�: not found
/hdd2/Espressif/xtensa-lx106-elf/bin/xtensa-lx106-elf-gcc: 3: /hdd2/Espressif/xtensa-lx106-elf/bin/xtensa-lx106-elf-gcc: t�: not found
/hdd2/Espressif/xtensa-lx106-elf/bin/xtensa-lx106-elf-gcc: 4: /hdd2/Espressif/xtensa-lx106-elf/bin/xtensa-lx106-elf-gcc: �: not found
/hdd2/Espressif/xtensa-lx106-elf/bin/xtensa-lx106-elf-gcc: 5: /hdd2/Espressif/xtensa-lx106-elf/bin/xtensa-lx106-elf-gcc: Syntax error: word unexpected (expecting ")")
DEPEND: xtensa-lx106-elf-gcc -M -Os -ggdb -std=gnu99 -Werror -Wpointer-arith -Wundef -Wall -Wl,-EL -fno-inline-functions -nostdlib -mlongcalls -mtext-section-literals -D__ets__ -DICACHE_FLASH -Wno-address -g -Wpointer-arith -Wundef -Werror -Wl,-EL -fno-inline-functions -nostdlib -mlongcalls -mtext-section-literals -ffunction-sections -fdata-sections -DICACHE_FLASH -DESP8266 -D__SINGLE_THREAD -D__EH_DISABLED -D__BOARD_dimmer -DCFG_SECTOR=0x3C -DNOSSL=1 -I include -I ./ -I ../include -I ../include -I ../include/eagle -I ../driver_lib/include supla_dht.c
/hdd2/Espressif/xtensa-lx106-elf/bin/xtensa-lx106-elf-gcc: 1: /hdd2/Espressif/xtensa-lx106-elf/bin/xtensa-lx106-elf-gcc: ELF: not found
/hdd2/Espressif/xtensa-lx106-elf/bin/xtensa-lx106-elf-gcc: 2: /hdd2/Espressif/xtensa-lx106-elf/bin/xtensa-lx106-elf-gcc: @@@@@@@��@@@@t�: not found
/hdd2/Espressif/xtensa-lx106-elf/bin/xtensa-lx106-elf-gcc: 3: /hdd2/Espressif/xtensa-lx106-elf/bin/xtensa-lx106-elf-gcc: t�: not found
/hdd2/Espressif/xtensa-lx106-elf/bin/xtensa-lx106-elf-gcc: 4: /hdd2/Espressif/xtensa-lx106-elf/bin/xtensa-lx106-elf-gcc: �: not found
/hdd2/Espressif/xtensa-lx106-elf/bin/xtensa-lx106-elf-gcc: 5: /hdd2/Espressif/xtensa-lx106-elf/bin/xtensa-lx106-elf-gcc: Syntax error: word unexpected (expecting ")")
DEPEND: xtensa-lx106-elf-gcc -M -Os -ggdb -std=gnu99 -Werror -Wpointer-arith -Wundef -Wall -Wl,-EL -fno-inline-functions -nostdlib -mlongcalls -mtext-section-literals -D__ets__ -DICACHE_FLASH -Wno-address -g -Wpointer-arith -Wundef -Werror -Wl,-EL -fno-inline-functions -nostdlib -mlongcalls -mtext-section-literals -ffunction-sections -fdata-sections -DICACHE_FLASH -DESP8266 -D__SINGLE_THREAD -D__EH_DISABLED -D__BOARD_dimmer -DCFG_SECTOR=0x3C -DNOSSL=1 -I include -I ./ -I ../include -I ../include -I ../include/eagle -I ../driver_lib/include supla_esp_impulse_counter.c
/hdd2/Espressif/xtensa-lx106-elf/bin/xtensa-lx106-elf-gcc: 1: /hdd2/Espressif/xtensa-lx106-elf/bin/xtensa-lx106-elf-gcc: ELF: not found
/hdd2/Espressif/xtensa-lx106-elf/bin/xtensa-lx106-elf-gcc: 2: /hdd2/Espressif/xtensa-lx106-elf/bin/xtensa-lx106-elf-gcc: @@@@@@@��@@@@t�: not found
/hdd2/Espressif/xtensa-lx106-elf/bin/xtensa-lx106-elf-gcc: 3: /hdd2/Espressif/xtensa-lx106-elf/bin/xtensa-lx106-elf-gcc: t�: not found
/hdd2/Espressif/xtensa-lx106-elf/bin/xtensa-lx106-elf-gcc: 4: /hdd2/Espressif/xtensa-lx106-elf/bin/xtensa-lx106-elf-gcc: �: not found
/hdd2/Espressif/xtensa-lx106-elf/bin/xtensa-lx106-elf-gcc: 5: /hdd2/Espressif/xtensa-lx106-elf/bin/xtensa-lx106-elf-gcc: Syntax error: word unexpected (expecting ")")
xtensa-lx106-elf-gcc -Os -ggdb -std=gnu99 -Werror -Wpointer-arith -Wundef -Wall -Wl,-EL -fno-inline-functions -nostdlib -mlongcalls -mtext-section-literals  -D__ets__ -DICACHE_FLASH -Wno-address -g -Wpointer-arith -Wundef -Werror -Wl,-EL -fno-inline-functions -nostdlib -mlongcalls -mtext-section-literals -ffunction-sections -fdata-sections  -DICACHE_FLASH -DESP8266 -D__SINGLE_THREAD -D__EH_DISABLED -D__BOARD_dimmer -DCFG_SECTOR=0x3C -DNOSSL=1  -I include -I ./  -I ../include  -I ../include -I ../include/eagle -I ../driver_lib/include  -o .output/eagle/debug/obj/supla_esp_impulse_counter.o -c supla_esp_impulse_counter.c
/hdd2/Espressif/xtensa-lx106-elf/bin/xtensa-lx106-elf-gcc: 1: /hdd2/Espressif/xtensa-lx106-elf/bin/xtensa-lx106-elf-gcc: ELF: not found
/hdd2/Espressif/xtensa-lx106-elf/bin/xtensa-lx106-elf-gcc: 2: /hdd2/Espressif/xtensa-lx106-elf/bin/xtensa-lx106-elf-gcc: @@@@@@@��@@@@t�: not found
/hdd2/Espressif/xtensa-lx106-elf/bin/xtensa-lx106-elf-gcc: 3: /hdd2/Espressif/xtensa-lx106-elf/bin/xtensa-lx106-elf-gcc: t�: not found
/hdd2/Espressif/xtensa-lx106-elf/bin/xtensa-lx106-elf-gcc: 4: /hdd2/Espressif/xtensa-lx106-elf/bin/xtensa-lx106-elf-gcc: �: not found
/hdd2/Espressif/xtensa-lx106-elf/bin/xtensa-lx106-elf-gcc: 5: /hdd2/Espressif/xtensa-lx106-elf/bin/xtensa-lx106-elf-gcc: Syntax error: word unexpected (expecting ")")
/hdd2/Espressif/ESP8266_NONOS_SDK154/Makefile:322: recipe for target '.output/eagle/debug/obj/supla_esp_impulse_counter.o' failed
make[1]: *** [.output/eagle/debug/obj/supla_esp_impulse_counter.o] Error 2
make[1]: Leaving directory '/CProjects/supla-espressif-esp/src/user'
/hdd2/Espressif/ESP8266_NONOS_SDK154/Makefile:308: recipe for target '.subdirs' failed
make: *** [.subdirs] Error 2
root@eccffbb80de0:/CProjects/supla-espressif-esp/src# clear

root@eccffbb80de0:/CProjects/supla-espressif-esp/src# ./build.sh dimmer
make -C user clean;  make -C driver clean;  make -C supla-dev clean;
make[1]: Entering directory '/CProjects/supla-espressif-esp/src/user'
rm -f -r .output/eagle/debug
make[1]: Leaving directory '/CProjects/supla-espressif-esp/src/user'
make[1]: Entering directory '/CProjects/supla-espressif-esp/src/driver'
rm -f -r .output/eagle/debug
make[1]: Leaving directory '/CProjects/supla-espressif-esp/src/driver'
make[1]: Entering directory '/CProjects/supla-espressif-esp/src/supla-dev'
rm -f -r .output/eagle/debug
make[1]: Leaving directory '/CProjects/supla-espressif-esp/src/supla-dev'
rm -f -r .output/eagle/debug
./build.sh: 296: [: Illegal number: 
make[1]: Entering directory '/CProjects/supla-espressif-esp/src/user'
DEPEND: xtensa-lx106-elf-gcc -M -Os -ggdb -std=gnu99 -Werror -Wpointer-arith -Wundef -Wall -Wl,-EL -fno-inline-functions -nostdlib -mlongcalls -mtext-section-literals -D__ets__ -DICACHE_FLASH -Wno-address -g -Wpointer-arith -Wundef -Werror -Wl,-EL -fno-inline-functions -nostdlib -mlongcalls -mtext-section-literals -ffunction-sections -fdata-sections -DICACHE_FLASH -DESP8266 -D__SINGLE_THREAD -D__EH_DISABLED -D__BOARD_dimmer -DCFG_SECTOR=0x3C -DNOSSL=1 -I include -I ./ -I ../include -I ../include -I ../include/eagle -I ../driver_lib/include supla_esp_cfgmode.c
/hdd2/Espressif/xtensa-lx106-elf/bin/xtensa-lx106-elf-gcc: 1: /hdd2/Espressif/xtensa-lx106-elf/bin/xtensa-lx106-elf-gcc: ELF: not found
/hdd2/Espressif/xtensa-lx106-elf/bin/xtensa-lx106-elf-gcc: 2: /hdd2/Espressif/xtensa-lx106-elf/bin/xtensa-lx106-elf-gcc: @@@@@@@��@@@@t�: not found
/hdd2/Espressif/xtensa-lx106-elf/bin/xtensa-lx106-elf-gcc: 3: /hdd2/Espressif/xtensa-lx106-elf/bin/xtensa-lx106-elf-gcc: t�: not found
/hdd2/Espressif/xtensa-lx106-elf/bin/xtensa-lx106-elf-gcc: 4: /hdd2/Espressif/xtensa-lx106-elf/bin/xtensa-lx106-elf-gcc: �: not found
/hdd2/Espressif/xtensa-lx106-elf/bin/xtensa-lx106-elf-gcc: 5: /hdd2/Espressif/xtensa-lx106-elf/bin/xtensa-lx106-elf-gcc: Syntax error: word unexpected (expecting ")")
DEPEND: xtensa-lx106-elf-gcc -M -Os -ggdb -std=gnu99 -Werror -Wpointer-arith -Wundef -Wall -Wl,-EL -fno-inline-functions -nostdlib -mlongcalls -mtext-section-literals -D__ets__ -DICACHE_FLASH -Wno-address -g -Wpointer-arith -Wundef -Werror -Wl,-EL -fno-inline-functions -nostdlib -mlongcalls -mtext-section-literals -ffunction-sections -fdata-sections -DICACHE_FLASH -DESP8266 -D__SINGLE_THREAD -D__EH_DISABLED -D__BOARD_dimmer -DCFG_SECTOR=0x3C -DNOSSL=1 -I include -I ./ -I ../include -I ../include -I ../include/eagle -I ../driver_lib/include supla_esp_hw_timer.c
/hdd2/Espressif/xtensa-lx106-elf/bin/xtensa-lx106-elf-gcc: 1: /hdd2/Espressif/xtensa-lx106-elf/bin/xtensa-lx106-elf-gcc: ELF: not found
/hdd2/Espressif/xtensa-lx106-elf/bin/xtensa-lx106-elf-gcc: 2: /hdd2/Espressif/xtensa-lx106-elf/bin/xtensa-lx106-elf-gcc: @@@@@@@��@@@@t�: not found
/hdd2/Espressif/xtensa-lx106-elf/bin/xtensa-lx106-elf-gcc: 3: /hdd2/Espressif/xtensa-lx106-elf/bin/xtensa-lx106-elf-gcc: t�: not found
/hdd2/Espressif/xtensa-lx106-elf/bin/xtensa-lx106-elf-gcc: 4: /hdd2/Espressif/xtensa-lx106-elf/bin/xtensa-lx106-elf-gcc: �: not found
/hdd2/Espressif/xtensa-lx106-elf/bin/xtensa-lx106-elf-gcc: 5: /hdd2/Espressif/xtensa-lx106-elf/bin/xtensa-lx106-elf-gcc: Syntax error: word unexpected (expecting ")")
DEPEND: xtensa-lx106-elf-gcc -M -Os -ggdb -std=gnu99 -Werror -Wpointer-arith -Wundef -Wall -Wl,-EL -fno-inline-functions -nostdlib -mlongcalls -mtext-section-literals -D__ets__ -DICACHE_FLASH -Wno-address -g -Wpointer-arith -Wundef -Werror -Wl,-EL -fno-inline-functions -nostdlib -mlongcalls -mtext-section-literals -ffunction-sections -fdata-sections -DICACHE_FLASH -DESP8266 -D__SINGLE_THREAD -D__EH_DISABLED -D__BOARD_dimmer -DCFG_SECTOR=0x3C -DNOSSL=1 -I include -I ./ -I ../include -I ../include -I ../include/eagle -I ../driver_lib/include supla_update.c
/hdd2/Espressif/xtensa-lx106-elf/bin/xtensa-lx106-elf-gcc: 1: /hdd2/Espressif/xtensa-lx106-elf/bin/xtensa-lx106-elf-gcc: ELF: not found
/hdd2/Espressif/xtensa-lx106-elf/bin/xtensa-lx106-elf-gcc: 2: /hdd2/Espressif/xtensa-lx106-elf/bin/xtensa-lx106-elf-gcc: @@@@@@@��@@@@t�: not found
/hdd2/Espressif/xtensa-lx106-elf/bin/xtensa-lx106-elf-gcc: 3: /hdd2/Espressif/xtensa-lx106-elf/bin/xtensa-lx106-elf-gcc: t�: not found
/hdd2/Espressif/xtensa-lx106-elf/bin/xtensa-lx106-elf-gcc: 4: /hdd2/Espressif/xtensa-lx106-elf/bin/xtensa-lx106-elf-gcc: �: not found
/hdd2/Espressif/xtensa-lx106-elf/bin/xtensa-lx106-elf-gcc: 5: /hdd2/Espressif/xtensa-lx106-elf/bin/xtensa-lx106-elf-gcc: Syntax error: word unexpected (expecting ")")
DEPEND: xtensa-lx106-elf-gcc -M -Os -ggdb -std=gnu99 -Werror -Wpointer-arith -Wundef -Wall -Wl,-EL -fno-inline-functions -nostdlib -mlongcalls -mtext-section-literals -D__ets__ -DICACHE_FLASH -Wno-address -g -Wpointer-arith -Wundef -Werror -Wl,-EL -fno-inline-functions -nostdlib -mlongcalls -mtext-section-literals -ffunction-sections -fdata-sections -DICACHE_FLASH -DESP8266 -D__SINGLE_THREAD -D__EH_DISABLED -D__BOARD_dimmer -DCFG_SECTOR=0x3C -DNOSSL=1 -I include -I ./ -I ../include -I ../include -I ../include/eagle -I ../driver_lib/include supla_esp_cfg.c
/hdd2/Espressif/xtensa-lx106-elf/bin/xtensa-lx106-elf-gcc: 1: /hdd2/Espressif/xtensa-lx106-elf/bin/xtensa-lx106-elf-gcc: ELF: not found
/hdd2/Espressif/xtensa-lx106-elf/bin/xtensa-lx106-elf-gcc: 2: /hdd2/Espressif/xtensa-lx106-elf/bin/xtensa-lx106-elf-gcc: @@@@@@@��@@@@t�: not found
/hdd2/Espressif/xtensa-lx106-elf/bin/xtensa-lx106-elf-gcc: 3: /hdd2/Espressif/xtensa-lx106-elf/bin/xtensa-lx106-elf-gcc: t�: not found
/hdd2/Espressif/xtensa-lx106-elf/bin/xtensa-lx106-elf-gcc: 4: /hdd2/Espressif/xtensa-lx106-elf/bin/xtensa-lx106-elf-gcc: �: not found
/hdd2/Espressif/xtensa-lx106-elf/bin/xtensa-lx106-elf-gcc: 5: /hdd2/Espressif/xtensa-lx106-elf/bin/xtensa-lx106-elf-gcc: Syntax error: word unexpected (expecting ")")
DEPEND: xtensa-lx106-elf-gcc -M -Os -ggdb -std=gnu99 -Werror -Wpointer-arith -Wundef -Wall -Wl,-EL -fno-inline-functions -nostdlib -mlongcalls -mtext-section-literals -D__ets__ -DICACHE_FLASH -Wno-address -g -Wpointer-arith -Wundef -Werror -Wl,-EL -fno-inline-functions -nostdlib -mlongcalls -mtext-section-literals -ffunction-sections -fdata-sections -DICACHE_FLASH -DESP8266 -D__SINGLE_THREAD -D__EH_DISABLED -D__BOARD_dimmer -DCFG_SECTOR=0x3C -DNOSSL=1 -I include -I ./ -I ../include -I ../include -I ../include/eagle -I ../driver_lib/include user_main.c
/hdd2/Espressif/xtensa-lx106-elf/bin/xtensa-lx106-elf-gcc: 1: /hdd2/Espressif/xtensa-lx106-elf/bin/xtensa-lx106-elf-gcc: ELF: not found
/hdd2/Espressif/xtensa-lx106-elf/bin/xtensa-lx106-elf-gcc: 2: /hdd2/Espressif/xtensa-lx106-elf/bin/xtensa-lx106-elf-gcc: @@@@@@@��@@@@t�: not found
/hdd2/Espressif/xtensa-lx106-elf/bin/xtensa-lx106-elf-gcc: 3: /hdd2/Espressif/xtensa-lx106-elf/bin/xtensa-lx106-elf-gcc: t�: not found
/hdd2/Espressif/xtensa-lx106-elf/bin/xtensa-lx106-elf-gcc: 4: /hdd2/Espressif/xtensa-lx106-elf/bin/xtensa-lx106-elf-gcc: �: not found
/hdd2/Espressif/xtensa-lx106-elf/bin/xtensa-lx106-elf-gcc: 5: /hdd2/Espressif/xtensa-lx106-elf/bin/xtensa-lx106-elf-gcc: Syntax error: word unexpected (expecting ")")
DEPEND: xtensa-lx106-elf-gcc -M -Os -ggdb -std=gnu99 -Werror -Wpointer-arith -Wundef -Wall -Wl,-EL -fno-inline-functions -nostdlib -mlongcalls -mtext-section-literals -D__ets__ -DICACHE_FLASH -Wno-address -g -Wpointer-arith -Wundef -Werror -Wl,-EL -fno-inline-functions -nostdlib -mlongcalls -mtext-section-literals -ffunction-sections -fdata-sections -DICACHE_FLASH -DESP8266 -D__SINGLE_THREAD -D__EH_DISABLED -D__BOARD_dimmer -DCFG_SECTOR=0x3C -DNOSSL=1 -I include -I ./ -I ../include -I ../include -I ../include/eagle -I ../driver_lib/include supla_ds18b20.c
/hdd2/Espressif/xtensa-lx106-elf/bin/xtensa-lx106-elf-gcc: 1: /hdd2/Espressif/xtensa-lx106-elf/bin/xtensa-lx106-elf-gcc: ELF: not found
/hdd2/Espressif/xtensa-lx106-elf/bin/xtensa-lx106-elf-gcc: 2: /hdd2/Espressif/xtensa-lx106-elf/bin/xtensa-lx106-elf-gcc: @@@@@@@��@@@@t�: not found
/hdd2/Espressif/xtensa-lx106-elf/bin/xtensa-lx106-elf-gcc: 3: /hdd2/Espressif/xtensa-lx106-elf/bin/xtensa-lx106-elf-gcc: t�: not found
/hdd2/Espressif/xtensa-lx106-elf/bin/xtensa-lx106-elf-gcc: 4: /hdd2/Espressif/xtensa-lx106-elf/bin/xtensa-lx106-elf-gcc: �: not found
/hdd2/Espressif/xtensa-lx106-elf/bin/xtensa-lx106-elf-gcc: 5: /hdd2/Espressif/xtensa-lx106-elf/bin/xtensa-lx106-elf-gcc: Syntax error: word unexpected (expecting ")")
DEPEND: xtensa-lx106-elf-gcc -M -Os -ggdb -std=gnu99 -Werror -Wpointer-arith -Wundef -Wall -Wl,-EL -fno-inline-functions -nostdlib -mlongcalls -mtext-section-literals -D__ets__ -DICACHE_FLASH -Wno-address -g -Wpointer-arith -Wundef -Werror -Wl,-EL -fno-inline-functions -nostdlib -mlongcalls -mtext-section-literals -ffunction-sections -fdata-sections -DICACHE_FLASH -DESP8266 -D__SINGLE_THREAD -D__EH_DISABLED -D__BOARD_dimmer -DCFG_SECTOR=0x3C -DNOSSL=1 -I include -I ./ -I ../include -I ../include -I ../include/eagle -I ../driver_lib/include supla_esp_pwm.c
/hdd2/Espressif/xtensa-lx106-elf/bin/xtensa-lx106-elf-gcc: 1: /hdd2/Espressif/xtensa-lx106-elf/bin/xtensa-lx106-elf-gcc: ELF: not found
/hdd2/Espressif/xtensa-lx106-elf/bin/xtensa-lx106-elf-gcc: 2: /hdd2/Espressif/xtensa-lx106-elf/bin/xtensa-lx106-elf-gcc: @@@@@@@��@@@@t�: not found
/hdd2/Espressif/xtensa-lx106-elf/bin/xtensa-lx106-elf-gcc: 3: /hdd2/Espressif/xtensa-lx106-elf/bin/xtensa-lx106-elf-gcc: t�: not found
/hdd2/Espressif/xtensa-lx106-elf/bin/xtensa-lx106-elf-gcc: 4: /hdd2/Espressif/xtensa-lx106-elf/bin/xtensa-lx106-elf-gcc: �: not found
/hdd2/Espressif/xtensa-lx106-elf/bin/xtensa-lx106-elf-gcc: 5: /hdd2/Espressif/xtensa-lx106-elf/bin/xtensa-lx106-elf-gcc: Syntax error: word unexpected (expecting ")")
DEPEND: xtensa-lx106-elf-gcc -M -Os -ggdb -std=gnu99 -Werror -Wpointer-arith -Wundef -Wall -Wl,-EL -fno-inline-functions -nostdlib -mlongcalls -mtext-section-literals -D__ets__ -DICACHE_FLASH -Wno-address -g -Wpointer-arith -Wundef -Werror -Wl,-EL -fno-inline-functions -nostdlib -mlongcalls -mtext-section-literals -ffunction-sections -fdata-sections -DICACHE_FLASH -DESP8266 -D__SINGLE_THREAD -D__EH_DISABLED -D__BOARD_dimmer -DCFG_SECTOR=0x3C -DNOSSL=1 -I include -I ./ -I ../include -I ../include -I ../include/eagle -I ../driver_lib/include supla_esp_devconn.c
/hdd2/Espressif/xtensa-lx106-elf/bin/xtensa-lx106-elf-gcc: 1: /hdd2/Espressif/xtensa-lx106-elf/bin/xtensa-lx106-elf-gcc: ELF: not found
/hdd2/Espressif/xtensa-lx106-elf/bin/xtensa-lx106-elf-gcc: 2: /hdd2/Espressif/xtensa-lx106-elf/bin/xtensa-lx106-elf-gcc: @@@@@@@��@@@@t�: not found
/hdd2/Espressif/xtensa-lx106-elf/bin/xtensa-lx106-elf-gcc: 3: /hdd2/Espressif/xtensa-lx106-elf/bin/xtensa-lx106-elf-gcc: t�: not found
/hdd2/Espressif/xtensa-lx106-elf/bin/xtensa-lx106-elf-gcc: 4: /hdd2/Espressif/xtensa-lx106-elf/bin/xtensa-lx106-elf-gcc: �: not found
/hdd2/Espressif/xtensa-lx106-elf/bin/xtensa-lx106-elf-gcc: 5: /hdd2/Espressif/xtensa-lx106-elf/bin/xtensa-lx106-elf-gcc: Syntax error: word unexpected (expecting ")")
DEPEND: xtensa-lx106-elf-gcc -M -Os -ggdb -std=gnu99 -Werror -Wpointer-arith -Wundef -Wall -Wl,-EL -fno-inline-functions -nostdlib -mlongcalls -mtext-section-literals -D__ets__ -DICACHE_FLASH -Wno-address -g -Wpointer-arith -Wundef -Werror -Wl,-EL -fno-inline-functions -nostdlib -mlongcalls -mtext-section-literals -ffunction-sections -fdata-sections -DICACHE_FLASH -DESP8266 -D__SINGLE_THREAD -D__EH_DISABLED -D__BOARD_dimmer -DCFG_SECTOR=0x3C -DNOSSL=1 -I include -I ./ -I ../include -I ../include -I ../include/eagle -I ../driver_lib/include supla_esp_electricity_meter.c
/hdd2/Espressif/xtensa-lx106-elf/bin/xtensa-lx106-elf-gcc: 1: /hdd2/Espressif/xtensa-lx106-elf/bin/xtensa-lx106-elf-gcc: ELF: not found
/hdd2/Espressif/xtensa-lx106-elf/bin/xtensa-lx106-elf-gcc: 2: /hdd2/Espressif/xtensa-lx106-elf/bin/xtensa-lx106-elf-gcc: @@@@@@@��@@@@t�: not found
/hdd2/Espressif/xtensa-lx106-elf/bin/xtensa-lx106-elf-gcc: 3: /hdd2/Espressif/xtensa-lx106-elf/bin/xtensa-lx106-elf-gcc: t�: not found
/hdd2/Espressif/xtensa-lx106-elf/bin/xtensa-lx106-elf-gcc: 4: /hdd2/Espressif/xtensa-lx106-elf/bin/xtensa-lx106-elf-gcc: �: not found
/hdd2/Espressif/xtensa-lx106-elf/bin/xtensa-lx106-elf-gcc: 5: /hdd2/Espressif/xtensa-lx106-elf/bin/xtensa-lx106-elf-gcc: Syntax error: word unexpected (expecting ")")
DEPEND: xtensa-lx106-elf-gcc -M -Os -ggdb -std=gnu99 -Werror -Wpointer-arith -Wundef -Wall -Wl,-EL -fno-inline-functions -nostdlib -mlongcalls -mtext-section-literals -D__ets__ -DICACHE_FLASH -Wno-address -g -Wpointer-arith -Wundef -Werror -Wl,-EL -fno-inline-functions -nostdlib -mlongcalls -mtext-section-literals -ffunction-sections -fdata-sections -DICACHE_FLASH -DESP8266 -D__SINGLE_THREAD -D__EH_DISABLED -D__BOARD_dimmer -DCFG_SECTOR=0x3C -DNOSSL=1 -I include -I ./ -I ../include -I ../include -I ../include/eagle -I ../driver_lib/include supla_esp_gpio.c
/hdd2/Espressif/xtensa-lx106-elf/bin/xtensa-lx106-elf-gcc: 1: /hdd2/Espressif/xtensa-lx106-elf/bin/xtensa-lx106-elf-gcc: ELF: not found
/hdd2/Espressif/xtensa-lx106-elf/bin/xtensa-lx106-elf-gcc: 2: /hdd2/Espressif/xtensa-lx106-elf/bin/xtensa-lx106-elf-gcc: @@@@@@@��@@@@t�: not found
/hdd2/Espressif/xtensa-lx106-elf/bin/xtensa-lx106-elf-gcc: 3: /hdd2/Espressif/xtensa-lx106-elf/bin/xtensa-lx106-elf-gcc: t�: not found
/hdd2/Espressif/xtensa-lx106-elf/bin/xtensa-lx106-elf-gcc: 4: /hdd2/Espressif/xtensa-lx106-elf/bin/xtensa-lx106-elf-gcc: �: not found
/hdd2/Espressif/xtensa-lx106-elf/bin/xtensa-lx106-elf-gcc: 5: /hdd2/Espressif/xtensa-lx106-elf/bin/xtensa-lx106-elf-gcc: Syntax error: word unexpected (expecting ")")
DEPEND: xtensa-lx106-elf-gcc -M -Os -ggdb -std=gnu99 -Werror -Wpointer-arith -Wundef -Wall -Wl,-EL -fno-inline-functions -nostdlib -mlongcalls -mtext-section-literals -D__ets__ -DICACHE_FLASH -Wno-address -g -Wpointer-arith -Wundef -Werror -Wl,-EL -fno-inline-functions -nostdlib -mlongcalls -mtext-section-literals -ffunction-sections -fdata-sections -DICACHE_FLASH -DESP8266 -D__SINGLE_THREAD -D__EH_DISABLED -D__BOARD_dimmer -DCFG_SECTOR=0x3C -DNOSSL=1 -I include -I ./ -I ../include -I ../include -I ../include/eagle -I ../driver_lib/include supla_w1.c
/hdd2/Espressif/xtensa-lx106-elf/bin/xtensa-lx106-elf-gcc: 1: /hdd2/Espressif/xtensa-lx106-elf/bin/xtensa-lx106-elf-gcc: ELF: not found
/hdd2/Espressif/xtensa-lx106-elf/bin/xtensa-lx106-elf-gcc: 2: /hdd2/Espressif/xtensa-lx106-elf/bin/xtensa-lx106-elf-gcc: @@@@@@@��@@@@t�: not found
/hdd2/Espressif/xtensa-lx106-elf/bin/xtensa-lx106-elf-gcc: 3: /hdd2/Espressif/xtensa-lx106-elf/bin/xtensa-lx106-elf-gcc: t�: not found
/hdd2/Espressif/xtensa-lx106-elf/bin/xtensa-lx106-elf-gcc: 4: /hdd2/Espressif/xtensa-lx106-elf/bin/xtensa-lx106-elf-gcc: �: not found
/hdd2/Espressif/xtensa-lx106-elf/bin/xtensa-lx106-elf-gcc: 5: /hdd2/Espressif/xtensa-lx106-elf/bin/xtensa-lx106-elf-gcc: Syntax error: word unexpected (expecting ")")
DEPEND: xtensa-lx106-elf-gcc -M -Os -ggdb -std=gnu99 -Werror -Wpointer-arith -Wundef -Wall -Wl,-EL -fno-inline-functions -nostdlib -mlongcalls -mtext-section-literals -D__ets__ -DICACHE_FLASH -Wno-address -g -Wpointer-arith -Wundef -Werror -Wl,-EL -fno-inline-functions -nostdlib -mlongcalls -mtext-section-literals -ffunction-sections -fdata-sections -DICACHE_FLASH -DESP8266 -D__SINGLE_THREAD -D__EH_DISABLED -D__BOARD_dimmer -DCFG_SECTOR=0x3C -DNOSSL=1 -I include -I ./ -I ../include -I ../include -I ../include/eagle -I ../driver_lib/include supla_dht.c
/hdd2/Espressif/xtensa-lx106-elf/bin/xtensa-lx106-elf-gcc: 1: /hdd2/Espressif/xtensa-lx106-elf/bin/xtensa-lx106-elf-gcc: ELF: not found
/hdd2/Espressif/xtensa-lx106-elf/bin/xtensa-lx106-elf-gcc: 2: /hdd2/Espressif/xtensa-lx106-elf/bin/xtensa-lx106-elf-gcc: @@@@@@@��@@@@t�: not found
/hdd2/Espressif/xtensa-lx106-elf/bin/xtensa-lx106-elf-gcc: 3: /hdd2/Espressif/xtensa-lx106-elf/bin/xtensa-lx106-elf-gcc: t�: not found
/hdd2/Espressif/xtensa-lx106-elf/bin/xtensa-lx106-elf-gcc: 4: /hdd2/Espressif/xtensa-lx106-elf/bin/xtensa-lx106-elf-gcc: �: not found
/hdd2/Espressif/xtensa-lx106-elf/bin/xtensa-lx106-elf-gcc: 5: /hdd2/Espressif/xtensa-lx106-elf/bin/xtensa-lx106-elf-gcc: Syntax error: word unexpected (expecting ")")
DEPEND: xtensa-lx106-elf-gcc -M -Os -ggdb -std=gnu99 -Werror -Wpointer-arith -Wundef -Wall -Wl,-EL -fno-inline-functions -nostdlib -mlongcalls -mtext-section-literals -D__ets__ -DICACHE_FLASH -Wno-address -g -Wpointer-arith -Wundef -Werror -Wl,-EL -fno-inline-functions -nostdlib -mlongcalls -mtext-section-literals -ffunction-sections -fdata-sections -DICACHE_FLASH -DESP8266 -D__SINGLE_THREAD -D__EH_DISABLED -D__BOARD_dimmer -DCFG_SECTOR=0x3C -DNOSSL=1 -I include -I ./ -I ../include -I ../include -I ../include/eagle -I ../driver_lib/include supla_esp_impulse_counter.c
/hdd2/Espressif/xtensa-lx106-elf/bin/xtensa-lx106-elf-gcc: 1: /hdd2/Espressif/xtensa-lx106-elf/bin/xtensa-lx106-elf-gcc: ELF: not found
/hdd2/Espressif/xtensa-lx106-elf/bin/xtensa-lx106-elf-gcc: 2: /hdd2/Espressif/xtensa-lx106-elf/bin/xtensa-lx106-elf-gcc: @@@@@@@��@@@@t�: not found
/hdd2/Espressif/xtensa-lx106-elf/bin/xtensa-lx106-elf-gcc: 3: /hdd2/Espressif/xtensa-lx106-elf/bin/xtensa-lx106-elf-gcc: t�: not found
/hdd2/Espressif/xtensa-lx106-elf/bin/xtensa-lx106-elf-gcc: 4: /hdd2/Espressif/xtensa-lx106-elf/bin/xtensa-lx106-elf-gcc: �: not found
/hdd2/Espressif/xtensa-lx106-elf/bin/xtensa-lx106-elf-gcc: 5: /hdd2/Espressif/xtensa-lx106-elf/bin/xtensa-lx106-elf-gcc: Syntax error: word unexpected (expecting ")")
xtensa-lx106-elf-gcc -Os -ggdb -std=gnu99 -Werror -Wpointer-arith -Wundef -Wall -Wl,-EL -fno-inline-functions -nostdlib -mlongcalls -mtext-section-literals  -D__ets__ -DICACHE_FLASH -Wno-address -g -Wpointer-arith -Wundef -Werror -Wl,-EL -fno-inline-functions -nostdlib -mlongcalls -mtext-section-literals -ffunction-sections -fdata-sections  -DICACHE_FLASH -DESP8266 -D__SINGLE_THREAD -D__EH_DISABLED -D__BOARD_dimmer -DCFG_SECTOR=0x3C -DNOSSL=1  -I include -I ./  -I ../include  -I ../include -I ../include/eagle -I ../driver_lib/include  -o .output/eagle/debug/obj/supla_esp_impulse_counter.o -c supla_esp_impulse_counter.c
/hdd2/Espressif/xtensa-lx106-elf/bin/xtensa-lx106-elf-gcc: 1: /hdd2/Espressif/xtensa-lx106-elf/bin/xtensa-lx106-elf-gcc: ELF: not found
/hdd2/Espressif/xtensa-lx106-elf/bin/xtensa-lx106-elf-gcc: 2: /hdd2/Espressif/xtensa-lx106-elf/bin/xtensa-lx106-elf-gcc: @@@@@@@��@@@@t�: not found
/hdd2/Espressif/xtensa-lx106-elf/bin/xtensa-lx106-elf-gcc: 3: /hdd2/Espressif/xtensa-lx106-elf/bin/xtensa-lx106-elf-gcc: t�: not found
/hdd2/Espressif/xtensa-lx106-elf/bin/xtensa-lx106-elf-gcc: 4: /hdd2/Espressif/xtensa-lx106-elf/bin/xtensa-lx106-elf-gcc: �: not found
/hdd2/Espressif/xtensa-lx106-elf/bin/xtensa-lx106-elf-gcc: 5: /hdd2/Espressif/xtensa-lx106-elf/bin/xtensa-lx106-elf-gcc: Syntax error: word unexpected (expecting ")")
/hdd2/Espressif/ESP8266_NONOS_SDK154/Makefile:322: recipe for target '.output/eagle/debug/obj/supla_esp_impulse_counter.o' failed
make[1]: *** [.output/eagle/debug/obj/supla_esp_impulse_counter.o] Error 2
make[1]: Leaving directory '/CProjects/supla-espressif-esp/src/user'
/hdd2/Espressif/ESP8266_NONOS_SDK154/Makefile:308: recipe for target '.subdirs' failed
make: *** [.subdirs] Error 2
root@eccffbb80de0:/CProjects/supla-espressif-esp/src# 


Awatar użytkownika
lesny8
Posty: 1181
Rejestracja: pn gru 11, 2017 9:43 pm

pn maja 27, 2019 7:08 pm

Wchodzisz do katalogu gdzie masz repo supla-docker i uruchamiasz kontener, ja mam w katalogu domowym

Kod: Zaznacz cały

cd ~/supla-docker
./run.sh
Wynik kompilacji płytki dimmer u mnie

Kod: Zaznacz cały

root@db9f7b5a0180:/CProjects/supla-espressif-esp/src# ./build.sh dimmer
make -C user clean;  make -C driver clean;  make -C supla-dev clean;
make[1]: Entering directory '/CProjects/supla-espressif-esp/src/user'
rm -f -r .output/eagle/debug
make[1]: Leaving directory '/CProjects/supla-espressif-esp/src/user'
make[1]: Entering directory '/CProjects/supla-espressif-esp/src/driver'
rm -f -r .output/eagle/debug
make[1]: Leaving directory '/CProjects/supla-espressif-esp/src/driver'
make[1]: Entering directory '/CProjects/supla-espressif-esp/src/supla-dev'
rm -f -r .output/eagle/debug
make[1]: Leaving directory '/CProjects/supla-espressif-esp/src/supla-dev'
rm -f -r .output/eagle/debug
./build.sh: 296: [: Illegal number: 
make[1]: Entering directory '/CProjects/supla-espressif-esp/src/user'
DEPEND: xtensa-lx106-elf-gcc -M -Os -ggdb -std=gnu99 -Werror -Wpointer-arith -Wundef -Wall -Wl,-EL -fno-inline-functions -nostdlib -mlongcalls -mtext-section-literals -D__ets__ -DICACHE_FLASH -Wno-address -g -Wpointer-arith -Wundef -Werror -Wl,-EL -fno-inline-functions -nostdlib -mlongcalls -mtext-section-literals -ffunction-sections -fdata-sections -DICACHE_FLASH -DESP8266 -D__SINGLE_THREAD -D__EH_DISABLED -D__BOARD_dimmer -DCFG_SECTOR=0x3C -DNOSSL=1 -I include -I ./ -I ../include -I ../include -I ../include/eagle -I ../driver_lib/include supla_ds18b20.c
DEPEND: xtensa-lx106-elf-gcc -M -Os -ggdb -std=gnu99 -Werror -Wpointer-arith -Wundef -Wall -Wl,-EL -fno-inline-functions -nostdlib -mlongcalls -mtext-section-literals -D__ets__ -DICACHE_FLASH -Wno-address -g -Wpointer-arith -Wundef -Werror -Wl,-EL -fno-inline-functions -nostdlib -mlongcalls -mtext-section-literals -ffunction-sections -fdata-sections -DICACHE_FLASH -DESP8266 -D__SINGLE_THREAD -D__EH_DISABLED -D__BOARD_dimmer -DCFG_SECTOR=0x3C -DNOSSL=1 -I include -I ./ -I ../include -I ../include -I ../include/eagle -I ../driver_lib/include supla_esp_cfgmode.c
DEPEND: xtensa-lx106-elf-gcc -M -Os -ggdb -std=gnu99 -Werror -Wpointer-arith -Wundef -Wall -Wl,-EL -fno-inline-functions -nostdlib -mlongcalls -mtext-section-literals -D__ets__ -DICACHE_FLASH -Wno-address -g -Wpointer-arith -Wundef -Werror -Wl,-EL -fno-inline-functions -nostdlib -mlongcalls -mtext-section-literals -ffunction-sections -fdata-sections -DICACHE_FLASH -DESP8266 -D__SINGLE_THREAD -D__EH_DISABLED -D__BOARD_dimmer -DCFG_SECTOR=0x3C -DNOSSL=1 -I include -I ./ -I ../include -I ../include -I ../include/eagle -I ../driver_lib/include supla_esp_hw_timer.c
DEPEND: xtensa-lx106-elf-gcc -M -Os -ggdb -std=gnu99 -Werror -Wpointer-arith -Wundef -Wall -Wl,-EL -fno-inline-functions -nostdlib -mlongcalls -mtext-section-literals -D__ets__ -DICACHE_FLASH -Wno-address -g -Wpointer-arith -Wundef -Werror -Wl,-EL -fno-inline-functions -nostdlib -mlongcalls -mtext-section-literals -ffunction-sections -fdata-sections -DICACHE_FLASH -DESP8266 -D__SINGLE_THREAD -D__EH_DISABLED -D__BOARD_dimmer -DCFG_SECTOR=0x3C -DNOSSL=1 -I include -I ./ -I ../include -I ../include -I ../include/eagle -I ../driver_lib/include supla_update.c
DEPEND: xtensa-lx106-elf-gcc -M -Os -ggdb -std=gnu99 -Werror -Wpointer-arith -Wundef -Wall -Wl,-EL -fno-inline-functions -nostdlib -mlongcalls -mtext-section-literals -D__ets__ -DICACHE_FLASH -Wno-address -g -Wpointer-arith -Wundef -Werror -Wl,-EL -fno-inline-functions -nostdlib -mlongcalls -mtext-section-literals -ffunction-sections -fdata-sections -DICACHE_FLASH -DESP8266 -D__SINGLE_THREAD -D__EH_DISABLED -D__BOARD_dimmer -DCFG_SECTOR=0x3C -DNOSSL=1 -I include -I ./ -I ../include -I ../include -I ../include/eagle -I ../driver_lib/include supla_esp_cfg.c
DEPEND: xtensa-lx106-elf-gcc -M -Os -ggdb -std=gnu99 -Werror -Wpointer-arith -Wundef -Wall -Wl,-EL -fno-inline-functions -nostdlib -mlongcalls -mtext-section-literals -D__ets__ -DICACHE_FLASH -Wno-address -g -Wpointer-arith -Wundef -Werror -Wl,-EL -fno-inline-functions -nostdlib -mlongcalls -mtext-section-literals -ffunction-sections -fdata-sections -DICACHE_FLASH -DESP8266 -D__SINGLE_THREAD -D__EH_DISABLED -D__BOARD_dimmer -DCFG_SECTOR=0x3C -DNOSSL=1 -I include -I ./ -I ../include -I ../include -I ../include/eagle -I ../driver_lib/include supla_dht.c
DEPEND: xtensa-lx106-elf-gcc -M -Os -ggdb -std=gnu99 -Werror -Wpointer-arith -Wundef -Wall -Wl,-EL -fno-inline-functions -nostdlib -mlongcalls -mtext-section-literals -D__ets__ -DICACHE_FLASH -Wno-address -g -Wpointer-arith -Wundef -Werror -Wl,-EL -fno-inline-functions -nostdlib -mlongcalls -mtext-section-literals -ffunction-sections -fdata-sections -DICACHE_FLASH -DESP8266 -D__SINGLE_THREAD -D__EH_DISABLED -D__BOARD_dimmer -DCFG_SECTOR=0x3C -DNOSSL=1 -I include -I ./ -I ../include -I ../include -I ../include/eagle -I ../driver_lib/include user_main.c
DEPEND: xtensa-lx106-elf-gcc -M -Os -ggdb -std=gnu99 -Werror -Wpointer-arith -Wundef -Wall -Wl,-EL -fno-inline-functions -nostdlib -mlongcalls -mtext-section-literals -D__ets__ -DICACHE_FLASH -Wno-address -g -Wpointer-arith -Wundef -Werror -Wl,-EL -fno-inline-functions -nostdlib -mlongcalls -mtext-section-literals -ffunction-sections -fdata-sections -DICACHE_FLASH -DESP8266 -D__SINGLE_THREAD -D__EH_DISABLED -D__BOARD_dimmer -DCFG_SECTOR=0x3C -DNOSSL=1 -I include -I ./ -I ../include -I ../include -I ../include/eagle -I ../driver_lib/include supla_esp_pwm.c
DEPEND: xtensa-lx106-elf-gcc -M -Os -ggdb -std=gnu99 -Werror -Wpointer-arith -Wundef -Wall -Wl,-EL -fno-inline-functions -nostdlib -mlongcalls -mtext-section-literals -D__ets__ -DICACHE_FLASH -Wno-address -g -Wpointer-arith -Wundef -Werror -Wl,-EL -fno-inline-functions -nostdlib -mlongcalls -mtext-section-literals -ffunction-sections -fdata-sections -DICACHE_FLASH -DESP8266 -D__SINGLE_THREAD -D__EH_DISABLED -D__BOARD_dimmer -DCFG_SECTOR=0x3C -DNOSSL=1 -I include -I ./ -I ../include -I ../include -I ../include/eagle -I ../driver_lib/include supla_esp_devconn.c
DEPEND: xtensa-lx106-elf-gcc -M -Os -ggdb -std=gnu99 -Werror -Wpointer-arith -Wundef -Wall -Wl,-EL -fno-inline-functions -nostdlib -mlongcalls -mtext-section-literals -D__ets__ -DICACHE_FLASH -Wno-address -g -Wpointer-arith -Wundef -Werror -Wl,-EL -fno-inline-functions -nostdlib -mlongcalls -mtext-section-literals -ffunction-sections -fdata-sections -DICACHE_FLASH -DESP8266 -D__SINGLE_THREAD -D__EH_DISABLED -D__BOARD_dimmer -DCFG_SECTOR=0x3C -DNOSSL=1 -I include -I ./ -I ../include -I ../include -I ../include/eagle -I ../driver_lib/include supla_esp_electricity_meter.c
DEPEND: xtensa-lx106-elf-gcc -M -Os -ggdb -std=gnu99 -Werror -Wpointer-arith -Wundef -Wall -Wl,-EL -fno-inline-functions -nostdlib -mlongcalls -mtext-section-literals -D__ets__ -DICACHE_FLASH -Wno-address -g -Wpointer-arith -Wundef -Werror -Wl,-EL -fno-inline-functions -nostdlib -mlongcalls -mtext-section-literals -ffunction-sections -fdata-sections -DICACHE_FLASH -DESP8266 -D__SINGLE_THREAD -D__EH_DISABLED -D__BOARD_dimmer -DCFG_SECTOR=0x3C -DNOSSL=1 -I include -I ./ -I ../include -I ../include -I ../include/eagle -I ../driver_lib/include supla_esp_gpio.c
DEPEND: xtensa-lx106-elf-gcc -M -Os -ggdb -std=gnu99 -Werror -Wpointer-arith -Wundef -Wall -Wl,-EL -fno-inline-functions -nostdlib -mlongcalls -mtext-section-literals -D__ets__ -DICACHE_FLASH -Wno-address -g -Wpointer-arith -Wundef -Werror -Wl,-EL -fno-inline-functions -nostdlib -mlongcalls -mtext-section-literals -ffunction-sections -fdata-sections -DICACHE_FLASH -DESP8266 -D__SINGLE_THREAD -D__EH_DISABLED -D__BOARD_dimmer -DCFG_SECTOR=0x3C -DNOSSL=1 -I include -I ./ -I ../include -I ../include -I ../include/eagle -I ../driver_lib/include supla_w1.c
DEPEND: xtensa-lx106-elf-gcc -M -Os -ggdb -std=gnu99 -Werror -Wpointer-arith -Wundef -Wall -Wl,-EL -fno-inline-functions -nostdlib -mlongcalls -mtext-section-literals -D__ets__ -DICACHE_FLASH -Wno-address -g -Wpointer-arith -Wundef -Werror -Wl,-EL -fno-inline-functions -nostdlib -mlongcalls -mtext-section-literals -ffunction-sections -fdata-sections -DICACHE_FLASH -DESP8266 -D__SINGLE_THREAD -D__EH_DISABLED -D__BOARD_dimmer -DCFG_SECTOR=0x3C -DNOSSL=1 -I include -I ./ -I ../include -I ../include -I ../include/eagle -I ../driver_lib/include supla_esp_impulse_counter.c
xtensa-lx106-elf-gcc -Os -ggdb -std=gnu99 -Werror -Wpointer-arith -Wundef -Wall -Wl,-EL -fno-inline-functions -nostdlib -mlongcalls -mtext-section-literals  -D__ets__ -DICACHE_FLASH -Wno-address -g -Wpointer-arith -Wundef -Werror -Wl,-EL -fno-inline-functions -nostdlib -mlongcalls -mtext-section-literals -ffunction-sections -fdata-sections  -DICACHE_FLASH -DESP8266 -D__SINGLE_THREAD -D__EH_DISABLED -D__BOARD_dimmer -DCFG_SECTOR=0x3C -DNOSSL=1  -I include -I ./  -I ../include  -I ../include -I ../include/eagle -I ../driver_lib/include  -o .output/eagle/debug/obj/supla_esp_impulse_counter.o -c supla_esp_impulse_counter.c
xtensa-lx106-elf-gcc -Os -ggdb -std=gnu99 -Werror -Wpointer-arith -Wundef -Wall -Wl,-EL -fno-inline-functions -nostdlib -mlongcalls -mtext-section-literals  -D__ets__ -DICACHE_FLASH -Wno-address -g -Wpointer-arith -Wundef -Werror -Wl,-EL -fno-inline-functions -nostdlib -mlongcalls -mtext-section-literals -ffunction-sections -fdata-sections  -DICACHE_FLASH -DESP8266 -D__SINGLE_THREAD -D__EH_DISABLED -D__BOARD_dimmer -DCFG_SECTOR=0x3C -DNOSSL=1  -I include -I ./  -I ../include  -I ../include -I ../include/eagle -I ../driver_lib/include  -o .output/eagle/debug/obj/supla_w1.o -c supla_w1.c
xtensa-lx106-elf-gcc -Os -ggdb -std=gnu99 -Werror -Wpointer-arith -Wundef -Wall -Wl,-EL -fno-inline-functions -nostdlib -mlongcalls -mtext-section-literals  -D__ets__ -DICACHE_FLASH -Wno-address -g -Wpointer-arith -Wundef -Werror -Wl,-EL -fno-inline-functions -nostdlib -mlongcalls -mtext-section-literals -ffunction-sections -fdata-sections  -DICACHE_FLASH -DESP8266 -D__SINGLE_THREAD -D__EH_DISABLED -D__BOARD_dimmer -DCFG_SECTOR=0x3C -DNOSSL=1  -I include -I ./  -I ../include  -I ../include -I ../include/eagle -I ../driver_lib/include  -o .output/eagle/debug/obj/supla_esp_gpio.o -c supla_esp_gpio.c
xtensa-lx106-elf-gcc -Os -ggdb -std=gnu99 -Werror -Wpointer-arith -Wundef -Wall -Wl,-EL -fno-inline-functions -nostdlib -mlongcalls -mtext-section-literals  -D__ets__ -DICACHE_FLASH -Wno-address -g -Wpointer-arith -Wundef -Werror -Wl,-EL -fno-inline-functions -nostdlib -mlongcalls -mtext-section-literals -ffunction-sections -fdata-sections  -DICACHE_FLASH -DESP8266 -D__SINGLE_THREAD -D__EH_DISABLED -D__BOARD_dimmer -DCFG_SECTOR=0x3C -DNOSSL=1  -I include -I ./  -I ../include  -I ../include -I ../include/eagle -I ../driver_lib/include  -o .output/eagle/debug/obj/supla_esp_electricity_meter.o -c supla_esp_electricity_meter.c
xtensa-lx106-elf-gcc -Os -ggdb -std=gnu99 -Werror -Wpointer-arith -Wundef -Wall -Wl,-EL -fno-inline-functions -nostdlib -mlongcalls -mtext-section-literals  -D__ets__ -DICACHE_FLASH -Wno-address -g -Wpointer-arith -Wundef -Werror -Wl,-EL -fno-inline-functions -nostdlib -mlongcalls -mtext-section-literals -ffunction-sections -fdata-sections  -DICACHE_FLASH -DESP8266 -D__SINGLE_THREAD -D__EH_DISABLED -D__BOARD_dimmer -DCFG_SECTOR=0x3C -DNOSSL=1  -I include -I ./  -I ../include  -I ../include -I ../include/eagle -I ../driver_lib/include  -o .output/eagle/debug/obj/supla_esp_devconn.o -c supla_esp_devconn.c
xtensa-lx106-elf-gcc -Os -ggdb -std=gnu99 -Werror -Wpointer-arith -Wundef -Wall -Wl,-EL -fno-inline-functions -nostdlib -mlongcalls -mtext-section-literals  -D__ets__ -DICACHE_FLASH -Wno-address -g -Wpointer-arith -Wundef -Werror -Wl,-EL -fno-inline-functions -nostdlib -mlongcalls -mtext-section-literals -ffunction-sections -fdata-sections  -DICACHE_FLASH -DESP8266 -D__SINGLE_THREAD -D__EH_DISABLED -D__BOARD_dimmer -DCFG_SECTOR=0x3C -DNOSSL=1  -I include -I ./  -I ../include  -I ../include -I ../include/eagle -I ../driver_lib/include  -o .output/eagle/debug/obj/supla_esp_pwm.o -c supla_esp_pwm.c
xtensa-lx106-elf-gcc -Os -ggdb -std=gnu99 -Werror -Wpointer-arith -Wundef -Wall -Wl,-EL -fno-inline-functions -nostdlib -mlongcalls -mtext-section-literals  -D__ets__ -DICACHE_FLASH -Wno-address -g -Wpointer-arith -Wundef -Werror -Wl,-EL -fno-inline-functions -nostdlib -mlongcalls -mtext-section-literals -ffunction-sections -fdata-sections  -DICACHE_FLASH -DESP8266 -D__SINGLE_THREAD -D__EH_DISABLED -D__BOARD_dimmer -DCFG_SECTOR=0x3C -DNOSSL=1  -I include -I ./  -I ../include  -I ../include -I ../include/eagle -I ../driver_lib/include  -o .output/eagle/debug/obj/user_main.o -c user_main.c
xtensa-lx106-elf-gcc -Os -ggdb -std=gnu99 -Werror -Wpointer-arith -Wundef -Wall -Wl,-EL -fno-inline-functions -nostdlib -mlongcalls -mtext-section-literals  -D__ets__ -DICACHE_FLASH -Wno-address -g -Wpointer-arith -Wundef -Werror -Wl,-EL -fno-inline-functions -nostdlib -mlongcalls -mtext-section-literals -ffunction-sections -fdata-sections  -DICACHE_FLASH -DESP8266 -D__SINGLE_THREAD -D__EH_DISABLED -D__BOARD_dimmer -DCFG_SECTOR=0x3C -DNOSSL=1  -I include -I ./  -I ../include  -I ../include -I ../include/eagle -I ../driver_lib/include  -o .output/eagle/debug/obj/supla_dht.o -c supla_dht.c
xtensa-lx106-elf-gcc -Os -ggdb -std=gnu99 -Werror -Wpointer-arith -Wundef -Wall -Wl,-EL -fno-inline-functions -nostdlib -mlongcalls -mtext-section-literals  -D__ets__ -DICACHE_FLASH -Wno-address -g -Wpointer-arith -Wundef -Werror -Wl,-EL -fno-inline-functions -nostdlib -mlongcalls -mtext-section-literals -ffunction-sections -fdata-sections  -DICACHE_FLASH -DESP8266 -D__SINGLE_THREAD -D__EH_DISABLED -D__BOARD_dimmer -DCFG_SECTOR=0x3C -DNOSSL=1  -I include -I ./  -I ../include  -I ../include -I ../include/eagle -I ../driver_lib/include  -o .output/eagle/debug/obj/supla_esp_cfg.o -c supla_esp_cfg.c
xtensa-lx106-elf-gcc -Os -ggdb -std=gnu99 -Werror -Wpointer-arith -Wundef -Wall -Wl,-EL -fno-inline-functions -nostdlib -mlongcalls -mtext-section-literals  -D__ets__ -DICACHE_FLASH -Wno-address -g -Wpointer-arith -Wundef -Werror -Wl,-EL -fno-inline-functions -nostdlib -mlongcalls -mtext-section-literals -ffunction-sections -fdata-sections  -DICACHE_FLASH -DESP8266 -D__SINGLE_THREAD -D__EH_DISABLED -D__BOARD_dimmer -DCFG_SECTOR=0x3C -DNOSSL=1  -I include -I ./  -I ../include  -I ../include -I ../include/eagle -I ../driver_lib/include  -o .output/eagle/debug/obj/supla_update.o -c supla_update.c
xtensa-lx106-elf-gcc -Os -ggdb -std=gnu99 -Werror -Wpointer-arith -Wundef -Wall -Wl,-EL -fno-inline-functions -nostdlib -mlongcalls -mtext-section-literals  -D__ets__ -DICACHE_FLASH -Wno-address -g -Wpointer-arith -Wundef -Werror -Wl,-EL -fno-inline-functions -nostdlib -mlongcalls -mtext-section-literals -ffunction-sections -fdata-sections  -DICACHE_FLASH -DESP8266 -D__SINGLE_THREAD -D__EH_DISABLED -D__BOARD_dimmer -DCFG_SECTOR=0x3C -DNOSSL=1  -I include -I ./  -I ../include  -I ../include -I ../include/eagle -I ../driver_lib/include  -o .output/eagle/debug/obj/supla_esp_hw_timer.o -c supla_esp_hw_timer.c
xtensa-lx106-elf-gcc -Os -ggdb -std=gnu99 -Werror -Wpointer-arith -Wundef -Wall -Wl,-EL -fno-inline-functions -nostdlib -mlongcalls -mtext-section-literals  -D__ets__ -DICACHE_FLASH -Wno-address -g -Wpointer-arith -Wundef -Werror -Wl,-EL -fno-inline-functions -nostdlib -mlongcalls -mtext-section-literals -ffunction-sections -fdata-sections  -DICACHE_FLASH -DESP8266 -D__SINGLE_THREAD -D__EH_DISABLED -D__BOARD_dimmer -DCFG_SECTOR=0x3C -DNOSSL=1  -I include -I ./  -I ../include  -I ../include -I ../include/eagle -I ../driver_lib/include  -o .output/eagle/debug/obj/supla_esp_cfgmode.o -c supla_esp_cfgmode.c
xtensa-lx106-elf-gcc -Os -ggdb -std=gnu99 -Werror -Wpointer-arith -Wundef -Wall -Wl,-EL -fno-inline-functions -nostdlib -mlongcalls -mtext-section-literals  -D__ets__ -DICACHE_FLASH -Wno-address -g -Wpointer-arith -Wundef -Werror -Wl,-EL -fno-inline-functions -nostdlib -mlongcalls -mtext-section-literals -ffunction-sections -fdata-sections  -DICACHE_FLASH -DESP8266 -D__SINGLE_THREAD -D__EH_DISABLED -D__BOARD_dimmer -DCFG_SECTOR=0x3C -DNOSSL=1  -I include -I ./  -I ../include  -I ../include -I ../include/eagle -I ../driver_lib/include  -o .output/eagle/debug/obj/supla_ds18b20.o -c supla_ds18b20.c
xtensa-lx106-elf-ar ru .output/eagle/debug/lib/libuser.a .output/eagle/debug/obj/supla_esp_impulse_counter.o .output/eagle/debug/obj/supla_w1.o .output/eagle/debug/obj/supla_esp_gpio.o .output/eagle/debug/obj/supla_esp_electricity_meter.o .output/eagle/debug/obj/supla_esp_devconn.o .output/eagle/debug/obj/supla_esp_pwm.o .output/eagle/debug/obj/user_main.o .output/eagle/debug/obj/supla_dht.o .output/eagle/debug/obj/supla_esp_cfg.o .output/eagle/debug/obj/supla_update.o .output/eagle/debug/obj/supla_esp_hw_timer.o .output/eagle/debug/obj/supla_esp_cfgmode.o .output/eagle/debug/obj/supla_ds18b20.o 
xtensa-lx106-elf-ar: creating .output/eagle/debug/lib/libuser.a
make[1]: Leaving directory '/CProjects/supla-espressif-esp/src/user'
make[1]: Entering directory '/CProjects/supla-espressif-esp/src/driver'
DEPEND: xtensa-lx106-elf-gcc -M -Os -ggdb -std=gnu99 -Werror -Wpointer-arith -Wundef -Wall -Wl,-EL -fno-inline-functions -nostdlib -mlongcalls -mtext-section-literals -D__ets__ -DICACHE_FLASH -Wno-address -g -Wpointer-arith -Wundef -Werror -Wl,-EL -fno-inline-functions -nostdlib -mlongcalls -mtext-section-literals -ffunction-sections -fdata-sections -DICACHE_FLASH -DESP8266 -D__SINGLE_THREAD -D__EH_DISABLED -D__BOARD_dimmer -DCFG_SECTOR=0x3C -DNOSSL=1 -I include -I ./ -I ../include -I ../include -I ../include/eagle -I ../driver_lib/include dht22.c
xtensa-lx106-elf-gcc -Os -ggdb -std=gnu99 -Werror -Wpointer-arith -Wundef -Wall -Wl,-EL -fno-inline-functions -nostdlib -mlongcalls -mtext-section-literals  -D__ets__ -DICACHE_FLASH -Wno-address -g -Wpointer-arith -Wundef -Werror -Wl,-EL -fno-inline-functions -nostdlib -mlongcalls -mtext-section-literals -ffunction-sections -fdata-sections  -DICACHE_FLASH -DESP8266 -D__SINGLE_THREAD -D__EH_DISABLED -D__BOARD_dimmer -DCFG_SECTOR=0x3C -DNOSSL=1  -I include -I ./ -I ../include  -I ../include -I ../include/eagle -I ../driver_lib/include  -o .output/eagle/debug/obj/dht22.o -c dht22.c
xtensa-lx106-elf-ar ru .output/eagle/debug/lib/libdriver.a .output/eagle/debug/obj/dht22.o 
xtensa-lx106-elf-ar: creating .output/eagle/debug/lib/libdriver.a
make[1]: Leaving directory '/CProjects/supla-espressif-esp/src/driver'
make[1]: Entering directory '/CProjects/supla-espressif-esp/src/supla-dev'
DEPEND: xtensa-lx106-elf-gcc -M -Os -ggdb -std=gnu99 -Werror -Wpointer-arith -Wundef -Wall -Wl,-EL -fno-inline-functions -nostdlib -mlongcalls -mtext-section-literals -D__ets__ -DICACHE_FLASH -Wno-address -g -Wpointer-arith -Wundef -Werror -Wl,-EL -fno-inline-functions -nostdlib -mlongcalls -mtext-section-literals -ffunction-sections -fdata-sections -DICACHE_FLASH -DESP8266 -D__SINGLE_THREAD -D__EH_DISABLED -D__BOARD_dimmer -DCFG_SECTOR=0x3C -DNOSSL=1 -I include -I ./ -I ../include/supla-dev -I ../include -I ../include -I ../include/eagle -I ../driver_lib/include proto.c
DEPEND: xtensa-lx106-elf-gcc -M -Os -ggdb -std=gnu99 -Werror -Wpointer-arith -Wundef -Wall -Wl,-EL -fno-inline-functions -nostdlib -mlongcalls -mtext-section-literals -D__ets__ -DICACHE_FLASH -Wno-address -g -Wpointer-arith -Wundef -Werror -Wl,-EL -fno-inline-functions -nostdlib -mlongcalls -mtext-section-literals -ffunction-sections -fdata-sections -DICACHE_FLASH -DESP8266 -D__SINGLE_THREAD -D__EH_DISABLED -D__BOARD_dimmer -DCFG_SECTOR=0x3C -DNOSSL=1 -I include -I ./ -I ../include/supla-dev -I ../include -I ../include -I ../include/eagle -I ../driver_lib/include srpc.c
DEPEND: xtensa-lx106-elf-gcc -M -Os -ggdb -std=gnu99 -Werror -Wpointer-arith -Wundef -Wall -Wl,-EL -fno-inline-functions -nostdlib -mlongcalls -mtext-section-literals -D__ets__ -DICACHE_FLASH -Wno-address -g -Wpointer-arith -Wundef -Werror -Wl,-EL -fno-inline-functions -nostdlib -mlongcalls -mtext-section-literals -ffunction-sections -fdata-sections -DICACHE_FLASH -DESP8266 -D__SINGLE_THREAD -D__EH_DISABLED -D__BOARD_dimmer -DCFG_SECTOR=0x3C -DNOSSL=1 -I include -I ./ -I ../include/supla-dev -I ../include -I ../include -I ../include/eagle -I ../driver_lib/include lck.c
DEPEND: xtensa-lx106-elf-gcc -M -Os -ggdb -std=gnu99 -Werror -Wpointer-arith -Wundef -Wall -Wl,-EL -fno-inline-functions -nostdlib -mlongcalls -mtext-section-literals -D__ets__ -DICACHE_FLASH -Wno-address -g -Wpointer-arith -Wundef -Werror -Wl,-EL -fno-inline-functions -nostdlib -mlongcalls -mtext-section-literals -ffunction-sections -fdata-sections -DICACHE_FLASH -DESP8266 -D__SINGLE_THREAD -D__EH_DISABLED -D__BOARD_dimmer -DCFG_SECTOR=0x3C -DNOSSL=1 -I include -I ./ -I ../include/supla-dev -I ../include -I ../include -I ../include/eagle -I ../driver_lib/include log.c
xtensa-lx106-elf-gcc -Os -ggdb -std=gnu99 -Werror -Wpointer-arith -Wundef -Wall -Wl,-EL -fno-inline-functions -nostdlib -mlongcalls -mtext-section-literals  -D__ets__ -DICACHE_FLASH -Wno-address -g -Wpointer-arith -Wundef -Werror -Wl,-EL -fno-inline-functions -nostdlib -mlongcalls -mtext-section-literals -ffunction-sections -fdata-sections  -DICACHE_FLASH -DESP8266 -D__SINGLE_THREAD -D__EH_DISABLED -D__BOARD_dimmer -DCFG_SECTOR=0x3C -DNOSSL=1  -I include  -I ./ -I ../include/supla-dev -I ../include  -I ../include -I ../include/eagle -I ../driver_lib/include  -o .output/eagle/debug/obj/log.o -c log.c
xtensa-lx106-elf-gcc -Os -ggdb -std=gnu99 -Werror -Wpointer-arith -Wundef -Wall -Wl,-EL -fno-inline-functions -nostdlib -mlongcalls -mtext-section-literals  -D__ets__ -DICACHE_FLASH -Wno-address -g -Wpointer-arith -Wundef -Werror -Wl,-EL -fno-inline-functions -nostdlib -mlongcalls -mtext-section-literals -ffunction-sections -fdata-sections  -DICACHE_FLASH -DESP8266 -D__SINGLE_THREAD -D__EH_DISABLED -D__BOARD_dimmer -DCFG_SECTOR=0x3C -DNOSSL=1  -I include  -I ./ -I ../include/supla-dev -I ../include  -I ../include -I ../include/eagle -I ../driver_lib/include  -o .output/eagle/debug/obj/lck.o -c lck.c
xtensa-lx106-elf-gcc -Os -ggdb -std=gnu99 -Werror -Wpointer-arith -Wundef -Wall -Wl,-EL -fno-inline-functions -nostdlib -mlongcalls -mtext-section-literals  -D__ets__ -DICACHE_FLASH -Wno-address -g -Wpointer-arith -Wundef -Werror -Wl,-EL -fno-inline-functions -nostdlib -mlongcalls -mtext-section-literals -ffunction-sections -fdata-sections  -DICACHE_FLASH -DESP8266 -D__SINGLE_THREAD -D__EH_DISABLED -D__BOARD_dimmer -DCFG_SECTOR=0x3C -DNOSSL=1  -I include  -I ./ -I ../include/supla-dev -I ../include  -I ../include -I ../include/eagle -I ../driver_lib/include  -o .output/eagle/debug/obj/srpc.o -c srpc.c
xtensa-lx106-elf-gcc -Os -ggdb -std=gnu99 -Werror -Wpointer-arith -Wundef -Wall -Wl,-EL -fno-inline-functions -nostdlib -mlongcalls -mtext-section-literals  -D__ets__ -DICACHE_FLASH -Wno-address -g -Wpointer-arith -Wundef -Werror -Wl,-EL -fno-inline-functions -nostdlib -mlongcalls -mtext-section-literals -ffunction-sections -fdata-sections  -DICACHE_FLASH -DESP8266 -D__SINGLE_THREAD -D__EH_DISABLED -D__BOARD_dimmer -DCFG_SECTOR=0x3C -DNOSSL=1  -I include  -I ./ -I ../include/supla-dev -I ../include  -I ../include -I ../include/eagle -I ../driver_lib/include  -o .output/eagle/debug/obj/proto.o -c proto.c
xtensa-lx106-elf-ar ru .output/eagle/debug/lib/libsupladev.a .output/eagle/debug/obj/log.o .output/eagle/debug/obj/lck.o .output/eagle/debug/obj/srpc.o .output/eagle/debug/obj/proto.o 
xtensa-lx106-elf-ar: creating .output/eagle/debug/lib/libsupladev.a
make[1]: Leaving directory '/CProjects/supla-espressif-esp/src/supla-dev'
xtensa-lx106-elf-gcc  -L/hdd2/Espressif/ESP8266_NONOS_SDK154/lib -Wl,--gc-sections -nostdlib -T/hdd2/Espressif/ESP8266_NONOS_SDK154/ld/eagle.app.v6.ld -Wl,--no-check-sections -u call_user_start -Wl,-static -Wl,--start-group -lc -lgcc -lpp -lphy -lnet80211 -lwpa -lmain -llwip -lcrypto -lpwm user/.output/eagle/debug/lib/libuser.a driver/.output/eagle/debug/lib/libdriver.a supla-dev/.output/eagle/debug/lib/libsupladev.a -Wl,--end-group -o .output/eagle/debug/image/eagle.app.v6.out 

!!!
No boot needed.
Generate eagle.flash.bin and eagle.irom0text.bin successully in folder bin.
eagle.flash.bin-------->0x00000
eagle.irom0text.bin---->0x40000
!!!
root@db9f7b5a0180:/CProjects/supla-espressif-esp/src# exit
exit
Po wyjściu z kontenera pliki masz w lokalizacji

Kod: Zaznacz cały

cd ~/CProjects/supla-espressif-esp/firmware/
~/CProjects/supla-espressif-esp/firmware$ ls
dimmer_nossl_1024_DIO_eagle.flash.bin
dimmer_nossl_1024_DIO_eagle.irom0text.bin
U Ciebie widzę, że są jakieś kłopoty ze skompilowaniem. Może spróbuj wybydować obraz jeszcze raz.
Usuń najpierw wszystkie kontenery a potem obraz

Kod: Zaznacz cały

docker rm $(docker ps -a -q)
docker rmi devel/esp8266
a następnie udaj się do lokalizacji z repo i wybuduj jeszcze raz

Kod: Zaznacz cały

cd ~/supla-docker
./build.sh
Uruchom kontener, pobierz zmiany i spróbuj skompilować

Kod: Zaznacz cały

./run.sh
git pull
./build.sh dimmer
cino111
Posty: 712
Rejestracja: pn maja 07, 2018 8:00 pm

pn maja 27, 2019 8:30 pm

Usunąłem kontener i obraz ale nic to nie dało

Kod: Zaznacz cały

marcin@marcin-HP:~/supla-docker$ ./run.sh
root@72c08db7d3bb:/CProjects/supla-espressif-esp/src# git pull
Already up-to-date.
root@72c08db7d3bb:/CProjects/supla-espressif-esp/src# ./build.sh dimmer
make -C user clean;  make -C driver clean;  make -C supla-dev clean;
make[1]: Entering directory '/CProjects/supla-espressif-esp/src/user'
rm -f -r .output/eagle/debug
make[1]: Leaving directory '/CProjects/supla-espressif-esp/src/user'
make[1]: Entering directory '/CProjects/supla-espressif-esp/src/driver'
rm -f -r .output/eagle/debug
make[1]: Leaving directory '/CProjects/supla-espressif-esp/src/driver'
make[1]: Entering directory '/CProjects/supla-espressif-esp/src/supla-dev'
rm -f -r .output/eagle/debug
make[1]: Leaving directory '/CProjects/supla-espressif-esp/src/supla-dev'
rm -f -r .output/eagle/debug
./build.sh: 296: [: Illegal number: 
make[1]: Entering directory '/CProjects/supla-espressif-esp/src/user'
DEPEND: xtensa-lx106-elf-gcc -M -Os -ggdb -std=gnu99 -Werror -Wpointer-arith -Wundef -Wall -Wl,-EL -fno-inline-functions -nostdlib -mlongcalls -mtext-section-literals -D__ets__ -DICACHE_FLASH -Wno-address -g -Wpointer-arith -Wundef -Werror -Wl,-EL -fno-inline-functions -nostdlib -mlongcalls -mtext-section-literals -ffunction-sections -fdata-sections -DICACHE_FLASH -DESP8266 -D__SINGLE_THREAD -D__EH_DISABLED -D__BOARD_dimmer -DCFG_SECTOR=0x3C -DNOSSL=1 -I include -I ./ -I ../include -I ../include -I ../include/eagle -I ../driver_lib/include supla_esp_cfgmode.c
/hdd2/Espressif/xtensa-lx106-elf/bin/xtensa-lx106-elf-gcc: 1: /hdd2/Espressif/xtensa-lx106-elf/bin/xtensa-lx106-elf-gcc: ELF: not found
/hdd2/Espressif/xtensa-lx106-elf/bin/xtensa-lx106-elf-gcc: 2: /hdd2/Espressif/xtensa-lx106-elf/bin/xtensa-lx106-elf-gcc: @@@@@@@��@@@@t�: not found
/hdd2/Espressif/xtensa-lx106-elf/bin/xtensa-lx106-elf-gcc: 3: /hdd2/Espressif/xtensa-lx106-elf/bin/xtensa-lx106-elf-gcc: t�: not found
/hdd2/Espressif/xtensa-lx106-elf/bin/xtensa-lx106-elf-gcc: 4: /hdd2/Espressif/xtensa-lx106-elf/bin/xtensa-lx106-elf-gcc: �: not found
/hdd2/Espressif/xtensa-lx106-elf/bin/xtensa-lx106-elf-gcc: 5: /hdd2/Espressif/xtensa-lx106-elf/bin/xtensa-lx106-elf-gcc: Syntax error: word unexpected (expecting ")")
DEPEND: xtensa-lx106-elf-gcc -M -Os -ggdb -std=gnu99 -Werror -Wpointer-arith -Wundef -Wall -Wl,-EL -fno-inline-functions -nostdlib -mlongcalls -mtext-section-literals -D__ets__ -DICACHE_FLASH -Wno-address -g -Wpointer-arith -Wundef -Werror -Wl,-EL -fno-inline-functions -nostdlib -mlongcalls -mtext-section-literals -ffunction-sections -fdata-sections -DICACHE_FLASH -DESP8266 -D__SINGLE_THREAD -D__EH_DISABLED -D__BOARD_dimmer -DCFG_SECTOR=0x3C -DNOSSL=1 -I include -I ./ -I ../include -I ../include -I ../include/eagle -I ../driver_lib/include supla_esp_hw_timer.c
/hdd2/Espressif/xtensa-lx106-elf/bin/xtensa-lx106-elf-gcc: 1: /hdd2/Espressif/xtensa-lx106-elf/bin/xtensa-lx106-elf-gcc: ELF: not found
/hdd2/Espressif/xtensa-lx106-elf/bin/xtensa-lx106-elf-gcc: 2: /hdd2/Espressif/xtensa-lx106-elf/bin/xtensa-lx106-elf-gcc: @@@@@@@��@@@@t�: not found
/hdd2/Espressif/xtensa-lx106-elf/bin/xtensa-lx106-elf-gcc: 3: /hdd2/Espressif/xtensa-lx106-elf/bin/xtensa-lx106-elf-gcc: t�: not found
/hdd2/Espressif/xtensa-lx106-elf/bin/xtensa-lx106-elf-gcc: 4: /hdd2/Espressif/xtensa-lx106-elf/bin/xtensa-lx106-elf-gcc: �: not found
/hdd2/Espressif/xtensa-lx106-elf/bin/xtensa-lx106-elf-gcc: 5: /hdd2/Espressif/xtensa-lx106-elf/bin/xtensa-lx106-elf-gcc: Syntax error: word unexpected (expecting ")")
DEPEND: xtensa-lx106-elf-gcc -M -Os -ggdb -std=gnu99 -Werror -Wpointer-arith -Wundef -Wall -Wl,-EL -fno-inline-functions -nostdlib -mlongcalls -mtext-section-literals -D__ets__ -DICACHE_FLASH -Wno-address -g -Wpointer-arith -Wundef -Werror -Wl,-EL -fno-inline-functions -nostdlib -mlongcalls -mtext-section-literals -ffunction-sections -fdata-sections -DICACHE_FLASH -DESP8266 -D__SINGLE_THREAD -D__EH_DISABLED -D__BOARD_dimmer -DCFG_SECTOR=0x3C -DNOSSL=1 -I include -I ./ -I ../include -I ../include -I ../include/eagle -I ../driver_lib/include supla_update.c
/hdd2/Espressif/xtensa-lx106-elf/bin/xtensa-lx106-elf-gcc: 1: /hdd2/Espressif/xtensa-lx106-elf/bin/xtensa-lx106-elf-gcc: ELF: not found
/hdd2/Espressif/xtensa-lx106-elf/bin/xtensa-lx106-elf-gcc: 2: /hdd2/Espressif/xtensa-lx106-elf/bin/xtensa-lx106-elf-gcc: @@@@@@@��@@@@t�: not found
/hdd2/Espressif/xtensa-lx106-elf/bin/xtensa-lx106-elf-gcc: 3: /hdd2/Espressif/xtensa-lx106-elf/bin/xtensa-lx106-elf-gcc: t�: not found
/hdd2/Espressif/xtensa-lx106-elf/bin/xtensa-lx106-elf-gcc: 4: /hdd2/Espressif/xtensa-lx106-elf/bin/xtensa-lx106-elf-gcc: �: not found
/hdd2/Espressif/xtensa-lx106-elf/bin/xtensa-lx106-elf-gcc: 5: /hdd2/Espressif/xtensa-lx106-elf/bin/xtensa-lx106-elf-gcc: Syntax error: word unexpected (expecting ")")
DEPEND: xtensa-lx106-elf-gcc -M -Os -ggdb -std=gnu99 -Werror -Wpointer-arith -Wundef -Wall -Wl,-EL -fno-inline-functions -nostdlib -mlongcalls -mtext-section-literals -D__ets__ -DICACHE_FLASH -Wno-address -g -Wpointer-arith -Wundef -Werror -Wl,-EL -fno-inline-functions -nostdlib -mlongcalls -mtext-section-literals -ffunction-sections -fdata-sections -DICACHE_FLASH -DESP8266 -D__SINGLE_THREAD -D__EH_DISABLED -D__BOARD_dimmer -DCFG_SECTOR=0x3C -DNOSSL=1 -I include -I ./ -I ../include -I ../include -I ../include/eagle -I ../driver_lib/include supla_esp_cfg.c
/hdd2/Espressif/xtensa-lx106-elf/bin/xtensa-lx106-elf-gcc: 1: /hdd2/Espressif/xtensa-lx106-elf/bin/xtensa-lx106-elf-gcc: ELF: not found
/hdd2/Espressif/xtensa-lx106-elf/bin/xtensa-lx106-elf-gcc: 2: /hdd2/Espressif/xtensa-lx106-elf/bin/xtensa-lx106-elf-gcc: @@@@@@@��@@@@t�: not found
/hdd2/Espressif/xtensa-lx106-elf/bin/xtensa-lx106-elf-gcc: 3: /hdd2/Espressif/xtensa-lx106-elf/bin/xtensa-lx106-elf-gcc: t�: not found
/hdd2/Espressif/xtensa-lx106-elf/bin/xtensa-lx106-elf-gcc: 4: /hdd2/Espressif/xtensa-lx106-elf/bin/xtensa-lx106-elf-gcc: �: not found
/hdd2/Espressif/xtensa-lx106-elf/bin/xtensa-lx106-elf-gcc: 5: /hdd2/Espressif/xtensa-lx106-elf/bin/xtensa-lx106-elf-gcc: Syntax error: word unexpected (expecting ")")
DEPEND: xtensa-lx106-elf-gcc -M -Os -ggdb -std=gnu99 -Werror -Wpointer-arith -Wundef -Wall -Wl,-EL -fno-inline-functions -nostdlib -mlongcalls -mtext-section-literals -D__ets__ -DICACHE_FLASH -Wno-address -g -Wpointer-arith -Wundef -Werror -Wl,-EL -fno-inline-functions -nostdlib -mlongcalls -mtext-section-literals -ffunction-sections -fdata-sections -DICACHE_FLASH -DESP8266 -D__SINGLE_THREAD -D__EH_DISABLED -D__BOARD_dimmer -DCFG_SECTOR=0x3C -DNOSSL=1 -I include -I ./ -I ../include -I ../include -I ../include/eagle -I ../driver_lib/include user_main.c
/hdd2/Espressif/xtensa-lx106-elf/bin/xtensa-lx106-elf-gcc: 1: /hdd2/Espressif/xtensa-lx106-elf/bin/xtensa-lx106-elf-gcc: ELF: not found
/hdd2/Espressif/xtensa-lx106-elf/bin/xtensa-lx106-elf-gcc: 2: /hdd2/Espressif/xtensa-lx106-elf/bin/xtensa-lx106-elf-gcc: @@@@@@@��@@@@t�: not found
/hdd2/Espressif/xtensa-lx106-elf/bin/xtensa-lx106-elf-gcc: 3: /hdd2/Espressif/xtensa-lx106-elf/bin/xtensa-lx106-elf-gcc: t�: not found
/hdd2/Espressif/xtensa-lx106-elf/bin/xtensa-lx106-elf-gcc: 4: /hdd2/Espressif/xtensa-lx106-elf/bin/xtensa-lx106-elf-gcc: �: not found
/hdd2/Espressif/xtensa-lx106-elf/bin/xtensa-lx106-elf-gcc: 5: /hdd2/Espressif/xtensa-lx106-elf/bin/xtensa-lx106-elf-gcc: Syntax error: word unexpected (expecting ")")
DEPEND: xtensa-lx106-elf-gcc -M -Os -ggdb -std=gnu99 -Werror -Wpointer-arith -Wundef -Wall -Wl,-EL -fno-inline-functions -nostdlib -mlongcalls -mtext-section-literals -D__ets__ -DICACHE_FLASH -Wno-address -g -Wpointer-arith -Wundef -Werror -Wl,-EL -fno-inline-functions -nostdlib -mlongcalls -mtext-section-literals -ffunction-sections -fdata-sections -DICACHE_FLASH -DESP8266 -D__SINGLE_THREAD -D__EH_DISABLED -D__BOARD_dimmer -DCFG_SECTOR=0x3C -DNOSSL=1 -I include -I ./ -I ../include -I ../include -I ../include/eagle -I ../driver_lib/include supla_ds18b20.c
/hdd2/Espressif/xtensa-lx106-elf/bin/xtensa-lx106-elf-gcc: 1: /hdd2/Espressif/xtensa-lx106-elf/bin/xtensa-lx106-elf-gcc: ELF: not found
/hdd2/Espressif/xtensa-lx106-elf/bin/xtensa-lx106-elf-gcc: 2: /hdd2/Espressif/xtensa-lx106-elf/bin/xtensa-lx106-elf-gcc: @@@@@@@��@@@@t�: not found
/hdd2/Espressif/xtensa-lx106-elf/bin/xtensa-lx106-elf-gcc: 3: /hdd2/Espressif/xtensa-lx106-elf/bin/xtensa-lx106-elf-gcc: t�: not found
/hdd2/Espressif/xtensa-lx106-elf/bin/xtensa-lx106-elf-gcc: 4: /hdd2/Espressif/xtensa-lx106-elf/bin/xtensa-lx106-elf-gcc: �: not found
/hdd2/Espressif/xtensa-lx106-elf/bin/xtensa-lx106-elf-gcc: 5: /hdd2/Espressif/xtensa-lx106-elf/bin/xtensa-lx106-elf-gcc: Syntax error: word unexpected (expecting ")")
DEPEND: xtensa-lx106-elf-gcc -M -Os -ggdb -std=gnu99 -Werror -Wpointer-arith -Wundef -Wall -Wl,-EL -fno-inline-functions -nostdlib -mlongcalls -mtext-section-literals -D__ets__ -DICACHE_FLASH -Wno-address -g -Wpointer-arith -Wundef -Werror -Wl,-EL -fno-inline-functions -nostdlib -mlongcalls -mtext-section-literals -ffunction-sections -fdata-sections -DICACHE_FLASH -DESP8266 -D__SINGLE_THREAD -D__EH_DISABLED -D__BOARD_dimmer -DCFG_SECTOR=0x3C -DNOSSL=1 -I include -I ./ -I ../include -I ../include -I ../include/eagle -I ../driver_lib/include supla_esp_pwm.c
/hdd2/Espressif/xtensa-lx106-elf/bin/xtensa-lx106-elf-gcc: 1: /hdd2/Espressif/xtensa-lx106-elf/bin/xtensa-lx106-elf-gcc: ELF: not found
/hdd2/Espressif/xtensa-lx106-elf/bin/xtensa-lx106-elf-gcc: 2: /hdd2/Espressif/xtensa-lx106-elf/bin/xtensa-lx106-elf-gcc: @@@@@@@��@@@@t�: not found
/hdd2/Espressif/xtensa-lx106-elf/bin/xtensa-lx106-elf-gcc: 3: /hdd2/Espressif/xtensa-lx106-elf/bin/xtensa-lx106-elf-gcc: t�: not found
/hdd2/Espressif/xtensa-lx106-elf/bin/xtensa-lx106-elf-gcc: 4: /hdd2/Espressif/xtensa-lx106-elf/bin/xtensa-lx106-elf-gcc: �: not found
/hdd2/Espressif/xtensa-lx106-elf/bin/xtensa-lx106-elf-gcc: 5: /hdd2/Espressif/xtensa-lx106-elf/bin/xtensa-lx106-elf-gcc: Syntax error: word unexpected (expecting ")")
DEPEND: xtensa-lx106-elf-gcc -M -Os -ggdb -std=gnu99 -Werror -Wpointer-arith -Wundef -Wall -Wl,-EL -fno-inline-functions -nostdlib -mlongcalls -mtext-section-literals -D__ets__ -DICACHE_FLASH -Wno-address -g -Wpointer-arith -Wundef -Werror -Wl,-EL -fno-inline-functions -nostdlib -mlongcalls -mtext-section-literals -ffunction-sections -fdata-sections -DICACHE_FLASH -DESP8266 -D__SINGLE_THREAD -D__EH_DISABLED -D__BOARD_dimmer -DCFG_SECTOR=0x3C -DNOSSL=1 -I include -I ./ -I ../include -I ../include -I ../include/eagle -I ../driver_lib/include supla_esp_devconn.c
/hdd2/Espressif/xtensa-lx106-elf/bin/xtensa-lx106-elf-gcc: 1: /hdd2/Espressif/xtensa-lx106-elf/bin/xtensa-lx106-elf-gcc: ELF: not found
/hdd2/Espressif/xtensa-lx106-elf/bin/xtensa-lx106-elf-gcc: 2: /hdd2/Espressif/xtensa-lx106-elf/bin/xtensa-lx106-elf-gcc: @@@@@@@��@@@@t�: not found
/hdd2/Espressif/xtensa-lx106-elf/bin/xtensa-lx106-elf-gcc: 3: /hdd2/Espressif/xtensa-lx106-elf/bin/xtensa-lx106-elf-gcc: t�: not found
/hdd2/Espressif/xtensa-lx106-elf/bin/xtensa-lx106-elf-gcc: 4: /hdd2/Espressif/xtensa-lx106-elf/bin/xtensa-lx106-elf-gcc: �: not found
/hdd2/Espressif/xtensa-lx106-elf/bin/xtensa-lx106-elf-gcc: 5: /hdd2/Espressif/xtensa-lx106-elf/bin/xtensa-lx106-elf-gcc: Syntax error: word unexpected (expecting ")")
DEPEND: xtensa-lx106-elf-gcc -M -Os -ggdb -std=gnu99 -Werror -Wpointer-arith -Wundef -Wall -Wl,-EL -fno-inline-functions -nostdlib -mlongcalls -mtext-section-literals -D__ets__ -DICACHE_FLASH -Wno-address -g -Wpointer-arith -Wundef -Werror -Wl,-EL -fno-inline-functions -nostdlib -mlongcalls -mtext-section-literals -ffunction-sections -fdata-sections -DICACHE_FLASH -DESP8266 -D__SINGLE_THREAD -D__EH_DISABLED -D__BOARD_dimmer -DCFG_SECTOR=0x3C -DNOSSL=1 -I include -I ./ -I ../include -I ../include -I ../include/eagle -I ../driver_lib/include supla_esp_electricity_meter.c
/hdd2/Espressif/xtensa-lx106-elf/bin/xtensa-lx106-elf-gcc: 1: /hdd2/Espressif/xtensa-lx106-elf/bin/xtensa-lx106-elf-gcc: ELF: not found
/hdd2/Espressif/xtensa-lx106-elf/bin/xtensa-lx106-elf-gcc: 2: /hdd2/Espressif/xtensa-lx106-elf/bin/xtensa-lx106-elf-gcc: @@@@@@@��@@@@t�: not found
/hdd2/Espressif/xtensa-lx106-elf/bin/xtensa-lx106-elf-gcc: 3: /hdd2/Espressif/xtensa-lx106-elf/bin/xtensa-lx106-elf-gcc: t�: not found
/hdd2/Espressif/xtensa-lx106-elf/bin/xtensa-lx106-elf-gcc: 4: /hdd2/Espressif/xtensa-lx106-elf/bin/xtensa-lx106-elf-gcc: �: not found
/hdd2/Espressif/xtensa-lx106-elf/bin/xtensa-lx106-elf-gcc: 5: /hdd2/Espressif/xtensa-lx106-elf/bin/xtensa-lx106-elf-gcc: Syntax error: word unexpected (expecting ")")
DEPEND: xtensa-lx106-elf-gcc -M -Os -ggdb -std=gnu99 -Werror -Wpointer-arith -Wundef -Wall -Wl,-EL -fno-inline-functions -nostdlib -mlongcalls -mtext-section-literals -D__ets__ -DICACHE_FLASH -Wno-address -g -Wpointer-arith -Wundef -Werror -Wl,-EL -fno-inline-functions -nostdlib -mlongcalls -mtext-section-literals -ffunction-sections -fdata-sections -DICACHE_FLASH -DESP8266 -D__SINGLE_THREAD -D__EH_DISABLED -D__BOARD_dimmer -DCFG_SECTOR=0x3C -DNOSSL=1 -I include -I ./ -I ../include -I ../include -I ../include/eagle -I ../driver_lib/include supla_esp_gpio.c
/hdd2/Espressif/xtensa-lx106-elf/bin/xtensa-lx106-elf-gcc: 1: /hdd2/Espressif/xtensa-lx106-elf/bin/xtensa-lx106-elf-gcc: ELF: not found
/hdd2/Espressif/xtensa-lx106-elf/bin/xtensa-lx106-elf-gcc: 2: /hdd2/Espressif/xtensa-lx106-elf/bin/xtensa-lx106-elf-gcc: @@@@@@@��@@@@t�: not found
/hdd2/Espressif/xtensa-lx106-elf/bin/xtensa-lx106-elf-gcc: 3: /hdd2/Espressif/xtensa-lx106-elf/bin/xtensa-lx106-elf-gcc: t�: not found
/hdd2/Espressif/xtensa-lx106-elf/bin/xtensa-lx106-elf-gcc: 4: /hdd2/Espressif/xtensa-lx106-elf/bin/xtensa-lx106-elf-gcc: �: not found
/hdd2/Espressif/xtensa-lx106-elf/bin/xtensa-lx106-elf-gcc: 5: /hdd2/Espressif/xtensa-lx106-elf/bin/xtensa-lx106-elf-gcc: Syntax error: word unexpected (expecting ")")
DEPEND: xtensa-lx106-elf-gcc -M -Os -ggdb -std=gnu99 -Werror -Wpointer-arith -Wundef -Wall -Wl,-EL -fno-inline-functions -nostdlib -mlongcalls -mtext-section-literals -D__ets__ -DICACHE_FLASH -Wno-address -g -Wpointer-arith -Wundef -Werror -Wl,-EL -fno-inline-functions -nostdlib -mlongcalls -mtext-section-literals -ffunction-sections -fdata-sections -DICACHE_FLASH -DESP8266 -D__SINGLE_THREAD -D__EH_DISABLED -D__BOARD_dimmer -DCFG_SECTOR=0x3C -DNOSSL=1 -I include -I ./ -I ../include -I ../include -I ../include/eagle -I ../driver_lib/include supla_w1.c
/hdd2/Espressif/xtensa-lx106-elf/bin/xtensa-lx106-elf-gcc: 1: /hdd2/Espressif/xtensa-lx106-elf/bin/xtensa-lx106-elf-gcc: ELF: not found
/hdd2/Espressif/xtensa-lx106-elf/bin/xtensa-lx106-elf-gcc: 2: /hdd2/Espressif/xtensa-lx106-elf/bin/xtensa-lx106-elf-gcc: @@@@@@@��@@@@t�: not found
/hdd2/Espressif/xtensa-lx106-elf/bin/xtensa-lx106-elf-gcc: 3: /hdd2/Espressif/xtensa-lx106-elf/bin/xtensa-lx106-elf-gcc: t�: not found
/hdd2/Espressif/xtensa-lx106-elf/bin/xtensa-lx106-elf-gcc: 4: /hdd2/Espressif/xtensa-lx106-elf/bin/xtensa-lx106-elf-gcc: �: not found
/hdd2/Espressif/xtensa-lx106-elf/bin/xtensa-lx106-elf-gcc: 5: /hdd2/Espressif/xtensa-lx106-elf/bin/xtensa-lx106-elf-gcc: Syntax error: word unexpected (expecting ")")
DEPEND: xtensa-lx106-elf-gcc -M -Os -ggdb -std=gnu99 -Werror -Wpointer-arith -Wundef -Wall -Wl,-EL -fno-inline-functions -nostdlib -mlongcalls -mtext-section-literals -D__ets__ -DICACHE_FLASH -Wno-address -g -Wpointer-arith -Wundef -Werror -Wl,-EL -fno-inline-functions -nostdlib -mlongcalls -mtext-section-literals -ffunction-sections -fdata-sections -DICACHE_FLASH -DESP8266 -D__SINGLE_THREAD -D__EH_DISABLED -D__BOARD_dimmer -DCFG_SECTOR=0x3C -DNOSSL=1 -I include -I ./ -I ../include -I ../include -I ../include/eagle -I ../driver_lib/include supla_dht.c
/hdd2/Espressif/xtensa-lx106-elf/bin/xtensa-lx106-elf-gcc: 1: /hdd2/Espressif/xtensa-lx106-elf/bin/xtensa-lx106-elf-gcc: ELF: not found
/hdd2/Espressif/xtensa-lx106-elf/bin/xtensa-lx106-elf-gcc: 2: /hdd2/Espressif/xtensa-lx106-elf/bin/xtensa-lx106-elf-gcc: @@@@@@@��@@@@t�: not found
/hdd2/Espressif/xtensa-lx106-elf/bin/xtensa-lx106-elf-gcc: 3: /hdd2/Espressif/xtensa-lx106-elf/bin/xtensa-lx106-elf-gcc: t�: not found
/hdd2/Espressif/xtensa-lx106-elf/bin/xtensa-lx106-elf-gcc: 4: /hdd2/Espressif/xtensa-lx106-elf/bin/xtensa-lx106-elf-gcc: �: not found
/hdd2/Espressif/xtensa-lx106-elf/bin/xtensa-lx106-elf-gcc: 5: /hdd2/Espressif/xtensa-lx106-elf/bin/xtensa-lx106-elf-gcc: Syntax error: word unexpected (expecting ")")
DEPEND: xtensa-lx106-elf-gcc -M -Os -ggdb -std=gnu99 -Werror -Wpointer-arith -Wundef -Wall -Wl,-EL -fno-inline-functions -nostdlib -mlongcalls -mtext-section-literals -D__ets__ -DICACHE_FLASH -Wno-address -g -Wpointer-arith -Wundef -Werror -Wl,-EL -fno-inline-functions -nostdlib -mlongcalls -mtext-section-literals -ffunction-sections -fdata-sections -DICACHE_FLASH -DESP8266 -D__SINGLE_THREAD -D__EH_DISABLED -D__BOARD_dimmer -DCFG_SECTOR=0x3C -DNOSSL=1 -I include -I ./ -I ../include -I ../include -I ../include/eagle -I ../driver_lib/include supla_esp_impulse_counter.c
/hdd2/Espressif/xtensa-lx106-elf/bin/xtensa-lx106-elf-gcc: 1: /hdd2/Espressif/xtensa-lx106-elf/bin/xtensa-lx106-elf-gcc: ELF: not found
/hdd2/Espressif/xtensa-lx106-elf/bin/xtensa-lx106-elf-gcc: 2: /hdd2/Espressif/xtensa-lx106-elf/bin/xtensa-lx106-elf-gcc: @@@@@@@��@@@@t�: not found
/hdd2/Espressif/xtensa-lx106-elf/bin/xtensa-lx106-elf-gcc: 3: /hdd2/Espressif/xtensa-lx106-elf/bin/xtensa-lx106-elf-gcc: t�: not found
/hdd2/Espressif/xtensa-lx106-elf/bin/xtensa-lx106-elf-gcc: 4: /hdd2/Espressif/xtensa-lx106-elf/bin/xtensa-lx106-elf-gcc: �: not found
/hdd2/Espressif/xtensa-lx106-elf/bin/xtensa-lx106-elf-gcc: 5: /hdd2/Espressif/xtensa-lx106-elf/bin/xtensa-lx106-elf-gcc: Syntax error: word unexpected (expecting ")")
xtensa-lx106-elf-gcc -Os -ggdb -std=gnu99 -Werror -Wpointer-arith -Wundef -Wall -Wl,-EL -fno-inline-functions -nostdlib -mlongcalls -mtext-section-literals  -D__ets__ -DICACHE_FLASH -Wno-address -g -Wpointer-arith -Wundef -Werror -Wl,-EL -fno-inline-functions -nostdlib -mlongcalls -mtext-section-literals -ffunction-sections -fdata-sections  -DICACHE_FLASH -DESP8266 -D__SINGLE_THREAD -D__EH_DISABLED -D__BOARD_dimmer -DCFG_SECTOR=0x3C -DNOSSL=1  -I include -I ./  -I ../include  -I ../include -I ../include/eagle -I ../driver_lib/include  -o .output/eagle/debug/obj/supla_esp_impulse_counter.o -c supla_esp_impulse_counter.c
/hdd2/Espressif/xtensa-lx106-elf/bin/xtensa-lx106-elf-gcc: 1: /hdd2/Espressif/xtensa-lx106-elf/bin/xtensa-lx106-elf-gcc: ELF: not found
/hdd2/Espressif/xtensa-lx106-elf/bin/xtensa-lx106-elf-gcc: 2: /hdd2/Espressif/xtensa-lx106-elf/bin/xtensa-lx106-elf-gcc: @@@@@@@��@@@@t�: not found
/hdd2/Espressif/xtensa-lx106-elf/bin/xtensa-lx106-elf-gcc: 3: /hdd2/Espressif/xtensa-lx106-elf/bin/xtensa-lx106-elf-gcc: t�: not found
/hdd2/Espressif/xtensa-lx106-elf/bin/xtensa-lx106-elf-gcc: 4: /hdd2/Espressif/xtensa-lx106-elf/bin/xtensa-lx106-elf-gcc: �: not found
/hdd2/Espressif/xtensa-lx106-elf/bin/xtensa-lx106-elf-gcc: 5: /hdd2/Espressif/xtensa-lx106-elf/bin/xtensa-lx106-elf-gcc: Syntax error: word unexpected (expecting ")")
/hdd2/Espressif/ESP8266_NONOS_SDK154/Makefile:322: recipe for target '.output/eagle/debug/obj/supla_esp_impulse_counter.o' failed
make[1]: *** [.output/eagle/debug/obj/supla_esp_impulse_counter.o] Error 2
make[1]: Leaving directory '/CProjects/supla-espressif-esp/src/user'
/hdd2/Espressif/ESP8266_NONOS_SDK154/Makefile:308: recipe for target '.subdirs' failed
make: *** [.subdirs] Error 2
root@72c08db7d3bb:/CProjects/supla-espressif-esp/src# 
Awatar użytkownika
pzygmunt
Posty: 8705
Rejestracja: wt sty 19, 2016 9:26 am
Lokalizacja: Paczków
Kontaktowanie:

pn maja 27, 2019 8:37 pm

Uruchom


/hdd2/Espressif/xtensa-lx106-elf/bin/xtensa-lx106-elf-gcc

I zobacz jaki będzie wynik. Oczywiście wewnątrz kontenera
cino111
Posty: 712
Rejestracja: pn maja 07, 2018 8:00 pm

pn maja 27, 2019 8:50 pm

Kod: Zaznacz cały

root@72c08db7d3bb:/CProjects/supla-espressif-esp/src# /hdd2/Espressif/xtensa-lx106-elf/bin/xtensa-lx106-elf-gcc
bash: /hdd2/Espressif/xtensa-lx106-elf/bin/xtensa-lx106-elf-gcc: cannot execute binary file: Exec format error
Awatar użytkownika
pzygmunt
Posty: 8705
Rejestracja: wt sty 19, 2016 9:26 am
Lokalizacja: Paczków
Kontaktowanie:

pn maja 27, 2019 8:55 pm

To jest binarka dla 64 bitów. Ty pewnie uruchamiasz kontener 32bitowy.

Jutro przygotuje jakiś „mądrzejszy” skrypt który pobierze 32bitowe środowisko.
cino111
Posty: 712
Rejestracja: pn maja 07, 2018 8:00 pm

pn maja 27, 2019 9:21 pm

Dokładnie mam 32 bit.
Awatar użytkownika
lesny8
Posty: 1181
Rejestracja: pn gru 11, 2017 9:43 pm

pn maja 27, 2019 9:37 pm

Na to bym nie wpadł :shock:
A w tym lapku masz procesor z instrukcjami x64 więc śmiało możesz instalować taką wersje Ubuntu.
cino111
Posty: 712
Rejestracja: pn maja 07, 2018 8:00 pm

wt maja 28, 2019 3:58 am

Ten laptop ma z 500 lat :lol: Procek Intel Celeron 2.13 GHz więc to chyba ten https://ark.intel.com/content/www/pl/pl ... z-fsb.html i faktycznie jest 64 bit :shock:
W takim razie chyba ściągnę wersję 64 bit Lubuntu.
Awatar użytkownika
pzygmunt
Posty: 8705
Rejestracja: wt sty 19, 2016 9:26 am
Lokalizacja: Paczków
Kontaktowanie:

wt maja 28, 2019 10:12 am

@cino111 sprawdź teraz na x86.
Teoretycznie powinno działać. Nie sprawdzałem w praktyce.
Zanim uruchomisz ./build.sh uruchom git pull
ODPOWIEDZ

Wróć do „Zagadnienia ogólne”